BDBM50089237 CHEMBL3577874
SMILES: CC(C)NC(=O)N1CCC(CC1)Nc1ncc2ccc(=O)n(C(C)C)c2n1
InChI Key: InChIKey=UVJIRZNCCXDTBQ-UHFFFAOYSA-N
Data: 2 IC50
Activity Spreadsheet -- Enzyme Inhibition Constant Data from BindingDB
Found 2 hits for monomerid = 50089237
Trg + Lig
Ki
nM
ΔG°
kcal/mole
IC50
nM
Kd
nM
EC50/IC50
nM
koff
s-1
kon
M-1s-1
pHTemp
°C
Mitogen-activated protein kinase 10
(Homo sapiens (Human))
BDBM50089237
(CHEMBL3577874)
Show SMILES CC(C)NC(=O)N1CCC(CC1)Nc1ncc2ccc(=O)n(C(C)C)c2n1
Show InChI InChI=1S/C19H28N6O2/c1-12(2)21-19(27)24-9-7-15(8-10-24)22-18-20-11-14-5-6-16(26)25(13(3)4)17(14)23-18/h5-6,11-13,15H,7-10H2,1-4H3,(H,21,27)(H,20,22,23)
NCI pathway
Reactome pathway
n/an/a 28n/an/an/an/an/an/a
Translational Research Institute
Curated by ChEMBL
Assay Description
Inhibition of JNK3alpha-1 (unknown origin) using biotinylated FL-ATF-2 as substrate after 1 hr by homogeneous time-resolved fluorescence assay
ACS Med Chem Lett 6: 413-8 (2015)
Article DOI: 10.1021/ml500474d
BindingDB Entry DOI: 10.7270/Q2KH0Q2N
Mitogen-activated protein kinase 8
(Homo sapiens (Human))
BDBM50089237
(CHEMBL3577874)
Show SMILES CC(C)NC(=O)N1CCC(CC1)Nc1ncc2ccc(=O)n(C(C)C)c2n1
Show InChI InChI=1S/C19H28N6O2/c1-12(2)21-19(27)24-9-7-15(8-10-24)22-18-20-11-14-5-6-16(26)25(13(3)4)17(14)23-18/h5-6,11-13,15H,7-10H2,1-4H3,(H,21,27)(H,20,22,23)
NCI pathway
Reactome pathway
n/an/a 36n/an/an/an/an/an/a
Translational Research Institute
Curated by ChEMBL
Assay Description
Inhibition of JNK1 (unknown origin) using biotinylated FL-ATF-2 as substrate after 1 hr by homogeneous time-resolved fluorescence assay
ACS Med Chem Lett 6: 413-8 (2015)
Article DOI: 10.1021/ml500474d
BindingDB Entry DOI: 10.7270/Q2KH0Q2N