BDBM50089978 5-[Bis-(2-chloro-ethyl)-amino]-1H-indole-2-carboxylic acid (5-{5-[5-(2-carbamimidoyl-ethylcarbamoyl)-1-methyl-1H-pyrrol-3-ylcarbamoyl]-1-methyl-1H-pyrrol-3-ylcarbamoyl}-1-methyl-1H-pyrrol-3-yl)-amide; hydrochloride::CHEMBL536328
SMILES: Cn1cc(NC(=O)c2cc(NC(=O)c3cc(NC(=O)c4cc5cc(ccc5[nH]4)N(CCCl)CCCl)cn3C)cn2C)cc1C(=O)NCCC(N)=N
InChI Key: InChIKey=HYSLEZHDLSYQLQ-UHFFFAOYSA-N
Data: 1 IC50
Activity Spreadsheet -- Enzyme Inhibition Constant Data from BindingDB
Found 1 hit for monomerid = 50089978
Trg + Lig
Ki
nM
ΔG°
kcal/mole
IC50
nM
Kd
nM
EC50/IC50
nM
koff
s-1
kon
M-1s-1
pHTemp
°C
GTPase HRas
(Homo sapiens (Human))
BDBM50089978
(5-[Bis-(2-chloro-ethyl)-amino]-1H-indole-2-carboxy...)
Show SMILES Cn1cc(NC(=O)c2cc(NC(=O)c3cc(NC(=O)c4cc5cc(ccc5[nH]4)N(CCCl)CCCl)cn3C)cn2C)cc1C(=O)NCCC(N)=N
Show InChI InChI=1S/C34H39Cl2N11O4/c1-44-18-22(14-27(44)32(49)39-9-6-30(37)38)41-34(51)29-16-23(19-46(29)3)42-33(50)28-15-21(17-45(28)2)40-31(48)26-13-20-12-24(4-5-25(20)43-26)47(10-7-35)11-8-36/h4-5,12-19,43H,6-11H2,1-3H3,(H3,37,38)(H,39,49)(H,40,48)(H,41,51)(H,42,50)
n/an/a 20n/an/an/an/an/an/a
Universit£ di Ferrara
Curated by ChEMBL
Assay Description
Tested for 50% inhibition of generation of Human Ha-ras polymerase chain reaction(PCR) products
J Med Chem 43: 2675-84 (2000)
BindingDB Entry DOI: 10.7270/Q2959J79