BDBM50092701 CHEMBL278078::N,N-Diethyl-4-[(2-methoxy-phenyl)-piperidin-4-ylidene-methyl]-benzamide
SMILES: [#6]-[#6]-[#7](-[#6]-[#6])-[#6](=O)-c1ccc(cc1)-[#6](=[#6]-1/[#6]-[#6]-[#7]-[#6]-[#6]-1)\c1ccccc1-[#8]-[#6]
InChI Key: InChIKey=MVXHVHQGOPGRBP-UHFFFAOYSA-N
Data: 3 IC50  1 EC50
Activity Spreadsheet -- Enzyme Inhibition Constant Data from BindingDB
Found 4 hits for monomerid = 50092701
Trg + Lig
Ki
nM
ΔG°
kcal/mole
IC50
nM
Kd
nM
EC50/IC50
nM
koff
s-1
kon
M-1s-1
pHTemp
°C
Delta-type opioid receptor
(Homo sapiens (Human))
BDBM50092701
(CHEMBL278078 | N,N-Diethyl-4-[(2-methoxy-phenyl)-p...)
Show SMILES [#6]-[#6]-[#7](-[#6]-[#6])-[#6](=O)-c1ccc(cc1)-[#6](=[#6]-1/[#6]-[#6]-[#7]-[#6]-[#6]-1)\c1ccccc1-[#8]-[#6]
Show InChI InChI=1S/C24H30N2O2/c1-4-26(5-2)24(27)20-12-10-18(11-13-20)23(19-14-16-25-17-15-19)21-8-6-7-9-22(21)28-3/h6-13,25H,4-5,14-17H2,1-3H3
Reactome pathway
n/an/an/an/a 5.90n/an/an/an/a
AstraZeneca R&D Montreal
Curated by ChEMBL
Assay Description
Effective concentration as delta agonist potency using [35S]GTP-gamma-S binding assay.
J Med Chem 43: 3895-905 (2000)
BindingDB Entry DOI: 10.7270/Q2KW5F95
Kappa-type opioid receptor
(Homo sapiens (Human))
BDBM50092701
(CHEMBL278078 | N,N-Diethyl-4-[(2-methoxy-phenyl)-p...)
Show SMILES [#6]-[#6]-[#7](-[#6]-[#6])-[#6](=O)-c1ccc(cc1)-[#6](=[#6]-1/[#6]-[#6]-[#7]-[#6]-[#6]-1)\c1ccccc1-[#8]-[#6]
Show InChI InChI=1S/C24H30N2O2/c1-4-26(5-2)24(27)20-12-10-18(11-13-20)23(19-14-16-25-17-15-19)21-8-6-7-9-22(21)28-3/h6-13,25H,4-5,14-17H2,1-3H3
Reactome pathway
n/an/a>1.00E+4n/an/an/an/an/an/a
AstraZeneca R&D Montreal
Curated by ChEMBL
Assay Description
Binding affinity on cloned opioid receptor kappa 1 in human HEK293S cells using [125I]-D-Pro10-dynorphin A[1-11] as radioligand.
J Med Chem 43: 3895-905 (2000)
BindingDB Entry DOI: 10.7270/Q2KW5F95
Mu-type opioid receptor
(Homo sapiens (Human))
BDBM50092701
(CHEMBL278078 | N,N-Diethyl-4-[(2-methoxy-phenyl)-p...)
Show SMILES [#6]-[#6]-[#7](-[#6]-[#6])-[#6](=O)-c1ccc(cc1)-[#6](=[#6]-1/[#6]-[#6]-[#7]-[#6]-[#6]-1)\c1ccccc1-[#8]-[#6]
Show InChI InChI=1S/C24H30N2O2/c1-4-26(5-2)24(27)20-12-10-18(11-13-20)23(19-14-16-25-17-15-19)21-8-6-7-9-22(21)28-3/h6-13,25H,4-5,14-17H2,1-3H3
NCI pathway
Reactome pathway
n/an/a 3.48E+3n/an/an/an/an/an/a
AstraZeneca R&D Montreal
Curated by ChEMBL
Assay Description
Binding affinity on cloned opioid receptor mu 1 in human HEK293S cells using [125I]FK33824 as radioligand.
J Med Chem 43: 3895-905 (2000)
BindingDB Entry DOI: 10.7270/Q2KW5F95
Delta-type opioid receptor
(Homo sapiens (Human))
BDBM50092701
(CHEMBL278078 | N,N-Diethyl-4-[(2-methoxy-phenyl)-p...)
Show SMILES [#6]-[#6]-[#7](-[#6]-[#6])-[#6](=O)-c1ccc(cc1)-[#6](=[#6]-1/[#6]-[#6]-[#7]-[#6]-[#6]-1)\c1ccccc1-[#8]-[#6]
Show InChI InChI=1S/C24H30N2O2/c1-4-26(5-2)24(27)20-12-10-18(11-13-20)23(19-14-16-25-17-15-19)21-8-6-7-9-22(21)28-3/h6-13,25H,4-5,14-17H2,1-3H3
Reactome pathway
n/an/a 0.970n/an/an/an/an/an/a
AstraZeneca R&D Montreal
Curated by ChEMBL
Assay Description
Binding affinity on cloned opioid receptor delta 1 in human HEK293S cells using [125I]-[D-Ala2]-deltorphin II as radioligand.
J Med Chem 43: 3895-905 (2000)
BindingDB Entry DOI: 10.7270/Q2KW5F95