null
SMILES: CCCCCN1C(=O)\C(=C\NC2CCCCC2)C(=O)c2cc(OC(F)(F)F)ccc12
InChI Key: InChIKey=LFTYSYOETXGMPB-NBVRZTHBSA-N
Activity Spreadsheet -- Enzyme Inhibition Constant Data from BindingDB
Found 2 hits for monomerid = 50095885
Trg + Lig
Ki
nM
ΔG°
kcal/mole
IC50
nM
Kd
nM
EC50/IC50
nM
koff
s-1
kon
M-1s-1
pHTemp
°C
Cannabinoid receptor 2
(Homo sapiens (Human))
BDBM50095885
(CHEMBL3590645)
Show SMILES CCCCCN1C(=O)\C(=C\NC2CCCCC2)C(=O)c2cc(OC(F)(F)F)ccc12
Show InChI InChI=1S/C22H27F3N2O3/c1-2-3-7-12-27-19-11-10-16(30-22(23,24)25)13-17(19)20(28)18(21(27)29)14-26-15-8-5-4-6-9-15/h10-11,13-15,26H,2-9,12H2,1H3/b18-14+
Reactome pathway
n/an/a>1.00E+4n/an/an/an/an/an/a
Zhejiang University
Curated by ChEMBL
Assay Description
Antagonist activity against CB2R (unknown origin) CHO cells stably expressing Galpha16 assessed as inhibition of CP55940-induced increase in intracel...
J Med Chem 58: 5751-69 (2015)
Article DOI: 10.1021/acs.jmedchem.5b00227
BindingDB Entry DOI: 10.7270/Q2Z039X8
Cannabinoid receptor 1
(Homo sapiens (Human))
BDBM50095885
(CHEMBL3590645)
Show SMILES CCCCCN1C(=O)\C(=C\NC2CCCCC2)C(=O)c2cc(OC(F)(F)F)ccc12
Show InChI InChI=1S/C22H27F3N2O3/c1-2-3-7-12-27-19-11-10-16(30-22(23,24)25)13-17(19)20(28)18(21(27)29)14-26-15-8-5-4-6-9-15/h10-11,13-15,26H,2-9,12H2,1H3/b18-14+
NCI pathway
Reactome pathway
n/an/a>1.00E+4n/an/an/an/an/an/a
Zhejiang University
Curated by ChEMBL
Assay Description
Antagonist activity against CB1R (unknown origin) CHO cells stably expressing Galpha16 assessed as inhibition of CP55940-induced increase in intracel...
J Med Chem 58: 5751-69 (2015)
Article DOI: 10.1021/acs.jmedchem.5b00227
BindingDB Entry DOI: 10.7270/Q2Z039X8