BDBM50096883 (5Z,8Z,11Z,14Z,17Z)-Icosa-5,8,11,14,17-pentaenoic acid [2-(3,4-dihydroxy-phenyl)-ethyl]-amide::CHEMBL138927
SMILES: CC\C=C/C\C=C/C\C=C/C\C=C/C\C=C/CCCC(=O)NCCc1ccc(O)c(O)c1
InChI Key: InChIKey=ONKDZYNMALBBQX-JLNKQSITSA-N
Data: 1 KI
Activity Spreadsheet -- Enzyme Inhibition Constant Data from BindingDB
Found 1 hit for monomerid = 50096883
Trg + Lig
Ki
nM
ΔG°
kcal/mole
IC50
nM
Kd
nM
EC50/IC50
nM
koff
s-1
kon
M-1s-1
pHTemp
°C
Cannabinoid receptor 1
(Rattus norvegicus (rat))
BDBM50096883
((5Z,8Z,11Z,14Z,17Z)-Icosa-5,8,11,14,17-pentaenoic ...)
Show SMILES CC\C=C/C\C=C/C\C=C/C\C=C/C\C=C/CCCC(=O)NCCc1ccc(O)c(O)c1
Show InChI InChI=1S/C28H39NO3/c1-2-3-4-5-6-7-8-9-10-11-12-13-14-15-16-17-18-19-28(32)29-23-22-25-20-21-26(30)27(31)24-25/h3-4,6-7,9-10,12-13,15-16,20-21,24,30-31H,2,5,8,11,14,17-19,22-23H2,1H3,(H,29,32)/b4-3-,7-6-,10-9-,13-12-,16-15-
Reactome pathway
620n/an/an/an/an/an/an/an/a
Institute of Bioorganic Chemistry RAS
Curated by ChEMBL
Assay Description
Concentration required to displace 0.4 nM [3H]-SR-141,716A from CB1 receptor in rat brain preparations in the presence of 0.1 mM phenylmethyl sulphon...
Bioorg Med Chem Lett 11: 447-9 (2001)
BindingDB Entry DOI: 10.7270/Q2VT1RBM