BDBM50097556 ALISOL B::Alisol B::CHEBI:81104
SMILES: [H][C@@]1(OC1(C)C)[C@@H](O)C[C@@H](C)C1=C2C[C@H](O)[C@@]3([H])[C@@]4(C)CCC(=O)C(C)(C)[C@]4([H])CC[C@]3(C)[C@@]2(C)CC1
InChI Key: InChIKey=FWIVADJGNZIHLQ-UHFFFAOYSA-N
Data: 1 IC50  1 Kd  1 EC50
Activity Spreadsheet -- Enzyme Inhibition Constant Data from BindingDB
Found 3 hits for monomerid = 50097556
Trg + Lig
Ki
nM
ΔG°
kcal/mole
IC50
nM
Kd
nM
EC50/IC50
nM
koff
s-1
kon
M-1s-1
pHTemp
°C
Sarcoplasmic/endoplasmic reticulum calcium ATP-ase
(Oryctolagus cuniculus)
BDBM50097556
(ALISOL B | Alisol B | CHEBI:81104)
Show SMILES [H][C@@]1(OC1(C)C)[C@@H](O)C[C@@H](C)C1=C2C[C@H](O)[C@@]3([H])[C@@]4(C)CCC(=O)C(C)(C)[C@]4([H])CC[C@]3(C)[C@@]2(C)CC1 |r,c:12|
Show InChI InChI=1S/C19H21N3O3/c1-4-10-25-15-11-20-17-16(13(15)2)18(23)22(19(24)21(17)3)12-14-8-6-5-7-9-14/h5-9,11H,4,10,12H2,1-3H3
n/an/an/a 2.70E+4n/an/an/an/an/a
Albert Ludwigs University Freiburg
Curated by ChEMBL
Assay Description
Binding affinity to rabbit hind leg muscle SERCA1a by pyruvate kinase and lactate dehydrogenase coupled assay
J Nat Prod 78: 1262-70 (2015)
Article DOI: 10.1021/acs.jnatprod.5b00062
BindingDB Entry DOI: 10.7270/Q2833TR2
Sarcoplasmic/endoplasmic reticulum calcium ATP-ase
(Oryctolagus cuniculus)
BDBM50097556
(ALISOL B | Alisol B | CHEBI:81104)
Show SMILES [H][C@@]1(OC1(C)C)[C@@H](O)C[C@@H](C)C1=C2C[C@H](O)[C@@]3([H])[C@@]4(C)CCC(=O)C(C)(C)[C@]4([H])CC[C@]3(C)[C@@]2(C)CC1 |r,c:12|
Show InChI InChI=1S/C19H21N3O3/c1-4-10-25-15-11-20-17-16(13(15)2)18(23)22(19(24)21(17)3)12-14-8-6-5-7-9-14/h5-9,11H,4,10,12H2,1-3H3
n/an/a 2.70E+4n/an/an/an/an/an/a
University of Chemistry and Technology Prague
Curated by ChEMBL
Assay Description
Inhibition of rabbit skeletal muscle microsomes SERCA1a by enzyme-coupled method
J Med Chem 63: 1937-1963 (2020)
Article DOI: 10.1021/acs.jmedchem.9b01509
Bile acid receptor FXR
(Homo sapiens (Human))
BDBM50097556
(ALISOL B | Alisol B | CHEBI:81104)
Show SMILES [H][C@@]1(OC1(C)C)[C@@H](O)C[C@@H](C)C1=C2C[C@H](O)[C@@]3([H])[C@@]4(C)CCC(=O)C(C)(C)[C@]4([H])CC[C@]3(C)[C@@]2(C)CC1 |r,c:12|
Show InChI InChI=1S/C19H21N3O3/c1-4-10-25-15-11-20-17-16(13(15)2)18(23)22(19(24)21(17)3)12-14-8-6-5-7-9-14/h5-9,11H,4,10,12H2,1-3H3
NCI pathway
Reactome pathway
n/an/an/an/a 8.80E+3n/an/an/an/a
Dalian Medical University
Curated by ChEMBL
Assay Description
Transactivation of FXR (unknown origin) transfected in HepG2 cells co-expressing pBSEP/pGL4.74 incubated for 24 hrs by luciferase reporter gene assay
Eur J Med Chem 182: (2019)
Article DOI: 10.1016/j.ejmech.2019.111652