BDBM50097999 CHEMBL3590218
SMILES: CC(C)[C@H]1CNC(=O)C(=O)N1C[C@@H]1CCCN1C[C@@H](Cc1ccc2ccccc2c1)N1C[C@@H](Cc2ccc(O)cc2)N(CC2CCCCC2)C(=O)C1=O
InChI Key: InChIKey=RWNPDBWKKCTTOI-WIQNKZILSA-N
Data: 1 IC50
Activity Spreadsheet -- Enzyme Inhibition Constant Data from BindingDB
Found 1 hit for monomerid = 50097999
Trg + Lig
Ki
nM
ΔG°
kcal/mole
IC50
nM
Kd
nM
EC50/IC50
nM
koff
s-1
kon
M-1s-1
pHTemp
°C
N-formyl peptide receptor 2
(Homo sapiens (Human))
BDBM50097999
(CHEMBL3590218)
Show SMILES CC(C)[C@H]1CNC(=O)C(=O)N1C[C@@H]1CCCN1C[C@@H](Cc1ccc2ccccc2c1)N1C[C@@H](Cc2ccc(O)cc2)N(CC2CCCCC2)C(=O)C1=O |r|
Show InChI InChI=1S/C43H55N5O5/c1-29(2)39-24-44-40(50)41(51)48(39)27-35-13-8-20-45(35)26-36(23-32-14-17-33-11-6-7-12-34(33)21-32)47-28-37(22-30-15-18-38(49)19-16-30)46(42(52)43(47)53)25-31-9-4-3-5-10-31/h6-7,11-12,14-19,21,29,31,35-37,39,49H,3-5,8-10,13,20,22-28H2,1-2H3,(H,44,50)/t35-,36+,37+,39+/m0/s1
NCI pathway
Reactome pathway
n/an/a 80n/an/an/an/an/an/a
University of Warsaw
Curated by ChEMBL
Assay Description
Antagonist activity against FPR2 (unknown origin) pre-treated for 5 mins before addition of Wpep by Fluo4 florescence based intracellular Ca2+ mobili...
Bioorg Med Chem 23: 4072-81 (2015)
Article DOI: 10.1016/j.bmc.2015.03.062
BindingDB Entry DOI: 10.7270/Q2KD20PR