BDBM50104872 CHEMBL3597535
SMILES: Cc1c(CCCC(O)=O)c2cccc(\C=C\c3ccc(OCCCCc4cccc(Cl)c4C)cc3)c2n1CC(O)=O
InChI Key: InChIKey=NGMXMVOLCRPNIG-OBGWFSINSA-N
Data: 2 IC50
Activity Spreadsheet -- Enzyme Inhibition Constant Data from BindingDB
Found 2 hits for monomerid = 50104872
Trg + Lig
Ki
nM
ΔG°
kcal/mole
IC50
nM
Kd
nM
EC50/IC50
nM
koff
s-1
kon
M-1s-1
pHTemp
°C
CYSLTR2
(Homo sapiens (Human))
BDBM50104872
(CHEMBL3597535)
Show SMILES Cc1c(CCCC(O)=O)c2cccc(\C=C\c3ccc(OCCCCc4cccc(Cl)c4C)cc3)c2n1CC(O)=O
Show InChI InChI=1S/C34H36ClNO5/c1-23-26(9-6-13-31(23)35)8-3-4-21-41-28-19-16-25(17-20-28)15-18-27-10-5-12-30-29(11-7-14-32(37)38)24(2)36(34(27)30)22-33(39)40/h5-6,9-10,12-13,15-20H,3-4,7-8,11,14,21-22H2,1-2H3,(H,37,38)(H,39,40)/b18-15+
Reactome pathway
n/an/a 5.10n/an/an/an/an/an/a
Setsunan University
Curated by ChEMBL
Assay Description
Antagonist activity at human CysLT2 expressed in HEK293 cells assessed as inhibition of LTD4-induced calcium mobilization preincubated for 30 mins pr...
J Med Chem 58: 6093-113 (2015)
BindingDB Entry DOI: 10.7270/Q2QJ7K27
Cysteinyl leukotriene receptor
(Homo sapiens (Human))
BDBM50104872
(CHEMBL3597535)
Show SMILES Cc1c(CCCC(O)=O)c2cccc(\C=C\c3ccc(OCCCCc4cccc(Cl)c4C)cc3)c2n1CC(O)=O
Show InChI InChI=1S/C34H36ClNO5/c1-23-26(9-6-13-31(23)35)8-3-4-21-41-28-19-16-25(17-20-28)15-18-27-10-5-12-30-29(11-7-14-32(37)38)24(2)36(34(27)30)22-33(39)40/h5-6,9-10,12-13,15-20H,3-4,7-8,11,14,21-22H2,1-2H3,(H,37,38)(H,39,40)/b18-15+
Reactome pathway
n/an/a 0.560n/an/an/an/an/an/a
Setsunan University
Curated by ChEMBL
Assay Description
Antagonist activity at human CysLT1 expressed in CHOK1 cells assessed as inhibition of LTD4-induced calcium mobilization preincubated for 30 mins pri...
J Med Chem 58: 6093-113 (2015)
BindingDB Entry DOI: 10.7270/Q2QJ7K27