BDBM50105029 4-tert-Butyl-N-[6-[2-(5-methylsulfanyl-pyrimidin-2-yloxy)-ethoxy]-5-(5-methyl-thiophen-2-yl)-pyrimidin-4-yl]-benzenesulfonamide::CHEMBL112141
SMILES: CSc1cnc(OCCOc2ncnc(NS(=O)(=O)c3ccc(cc3)C(C)(C)C)c2-c2ccc(C)s2)nc1
InChI Key: InChIKey=NZXFROYSERACSM-UHFFFAOYSA-N
Data: 1 IC50
Activity Spreadsheet -- Enzyme Inhibition Constant Data from BindingDB
Found 1 hit for monomerid = 50105029
Trg + Lig
Ki
nM
ΔG°
kcal/mole
IC50
nM
Kd
nM
EC50/IC50
nM
koff
s-1
kon
M-1s-1
pHTemp
°C
Endothelin receptor ET-A
(Sus scrofa)
BDBM50105029
(4-tert-Butyl-N-[6-[2-(5-methylsulfanyl-pyrimidin-2...)
Show SMILES CSc1cnc(OCCOc2ncnc(NS(=O)(=O)c3ccc(cc3)C(C)(C)C)c2-c2ccc(C)s2)nc1
Show InChI InChI=1S/C26H29N5O4S3/c1-17-6-11-21(37-17)22-23(31-38(32,33)20-9-7-18(8-10-20)26(2,3)4)29-16-30-24(22)34-12-13-35-25-27-14-19(36-5)15-28-25/h6-11,14-16H,12-13H2,1-5H3,(H,29,30,31)
Reactome pathway
n/an/a 0.160n/an/an/an/an/an/a
Tanabe Seiyaku Co., Ltd.
Curated by ChEMBL
Assay Description
In vitro inhibition of [125I]-ET-1 binding to Endothelin A receptor in porcine aortic membrane from endothelial cells
J Med Chem 44: 3355-68 (2001)
BindingDB Entry DOI: 10.7270/Q2QN662B