BDBM50106235 CHEMBL124810::N-(3-Hydroxy-2,2-dimethyl-6-propoxy-chroman-4-yl)-N-methyl-methanesulfonamide
SMILES: CCCOc1ccc2OC(C)(C)C(O)C(N(C)S(C)(=O)=O)c2c1
InChI Key: InChIKey=WYJVNBJXXVCVIH-UHFFFAOYSA-N
Data: 1 IC50
Activity Spreadsheet -- Enzyme Inhibition Constant Data from BindingDB
Found 1 hit for monomerid = 50106235
Trg + Lig
Ki
nM
ΔG°
kcal/mole
IC50
nM
Kd
nM
EC50/IC50
nM
koff
s-1
kon
M-1s-1
pHTemp
°C
Voltage-gated potassium channel beta subunit Mink/subunit Kv7.1
(Homo sapiens (Human))
BDBM50106235
(CHEMBL124810 | N-(3-Hydroxy-2,2-dimethyl-6-propoxy...)
Show SMILES CCCOc1ccc2OC(C)(C)C(O)C(N(C)S(C)(=O)=O)c2c1
Show InChI InChI=1S/C16H25NO5S/c1-6-9-21-11-7-8-13-12(10-11)14(17(4)23(5,19)20)15(18)16(2,3)22-13/h7-8,10,14-15,18H,6,9H2,1-5H3
n/an/a 900n/an/an/an/an/an/a
Aventis Pharma Deutschland GmbH
Curated by ChEMBL
Assay Description
Inhibition of human IKs-channel expressed in Xenopus oocytes
J Med Chem 44: 3831-7 (2001)
BindingDB Entry DOI: 10.7270/Q26H4GPX