BDBM50111393 CHEMBL3604785
SMILES: Oc1c(F)cc(cc1F)-c1cnccc1-c1cccc(c1)-c1cn[nH]c1
InChI Key: InChIKey=SKGOKFXHVKRTIW-UHFFFAOYSA-N
Data: 1 IC50  1 EC50
Activity Spreadsheet -- Enzyme Inhibition Constant Data from BindingDB
Found 2 hits for monomerid = 50111393
Trg + Lig
Ki
nM
ΔG°
kcal/mole
IC50
nM
Kd
nM
EC50/IC50
nM
koff
s-1
kon
M-1s-1
pHTemp
°C
Ribosomal protein S6 kinase alpha-3
(Mus musculus)
BDBM50111393
(CHEMBL3604785)
Show SMILES Oc1c(F)cc(cc1F)-c1cnccc1-c1cccc(c1)-c1cn[nH]c1
Show InChI InChI=1S/C20H13F2N3O/c21-18-7-14(8-19(22)20(18)26)17-11-23-5-4-16(17)13-3-1-2-12(6-13)15-9-24-25-10-15/h1-11,26H,(H,24,25)
n/an/an/an/a 1.10E+3n/an/an/an/a
Novartis Institutes for Biomedical Research
Curated by ChEMBL
Assay Description
Inhibition of RSK2 in mouse BAF cells expressing activated FGFR assessed as reduction of YB1 phosphorylation at Ser102 by electochemiluminescence ass...
J Med Chem 58: 6766-83 (2015)
BindingDB Entry DOI: 10.7270/Q21C1ZN6
Ribosomal protein S6 kinase alpha-3
(Homo sapiens (Human))
BDBM50111393
(CHEMBL3604785)
Show SMILES Oc1c(F)cc(cc1F)-c1cnccc1-c1cccc(c1)-c1cn[nH]c1
Show InChI InChI=1S/C20H13F2N3O/c21-18-7-14(8-19(22)20(18)26)17-11-23-5-4-16(17)13-3-1-2-12(6-13)15-9-24-25-10-15/h1-11,26H,(H,24,25)
Reactome pathway
n/an/a 5n/an/an/an/an/an/a
Novartis Institutes for Biomedical Research
Curated by ChEMBL
Assay Description
Inhibition of human recombinant Histidine-tagged RSK2 using biotin-AGAGRSRHSSYPAGT-OH as substrate preincubated for 30 mins followed by ATP and subst...
J Med Chem 58: 6766-83 (2015)
BindingDB Entry DOI: 10.7270/Q21C1ZN6