BDBM50111638 CHEMBL16044::N-[(S)-1-(11-Amino-undecylcarbamoyl)-2-(4-hydroxy-phenyl)-ethyl]-butyramide
SMILES: CCCC(=O)N[C@@H](Cc1ccc(O)cc1)C(=O)NCCCCCCCCCCCN
InChI Key: InChIKey=OZVULFLAPUPPFK-QFIPXVFZSA-N
Data: 2 IC50
Activity Spreadsheet -- Enzyme Inhibition Constant Data from BindingDB
Found 2 hits for monomerid = 50111638
Trg + Lig
Ki
nM
ΔG°
kcal/mole
IC50
nM
Kd
nM
EC50/IC50
nM
koff
s-1
kon
M-1s-1
pHTemp
°C
Muscle-type nicotinic acetylcholine receptor
(Homo sapiens (Human))
BDBM50111638
(CHEMBL16044 | N-[(S)-1-(11-Amino-undecylcarbamoyl)...)
Show SMILES CCCC(=O)N[C@@H](Cc1ccc(O)cc1)C(=O)NCCCCCCCCCCCN
Show InChI InChI=1S/C24H41N3O3/c1-2-12-23(29)27-22(19-20-13-15-21(28)16-14-20)24(30)26-18-11-9-7-5-3-4-6-8-10-17-25/h13-16,22,28H,2-12,17-19,25H2,1H3,(H,26,30)(H,27,29)/t22-/m0/s1
Reactome pathway
n/an/a 460n/an/an/an/an/an/a
The Royal Danish School of Pharmacy
Curated by ChEMBL
Assay Description
Compound was evaluated for inhibitory activity against human embryonic muscle type Nicotinic acetylcholine receptor specifically delta-subunit expres...
Bioorg Med Chem Lett 12: 1159-62 (2002)
BindingDB Entry DOI: 10.7270/Q2BC3XWG
Muscle-type nicotinic acetylcholine receptor
(Homo sapiens (Human))
BDBM50111638
(CHEMBL16044 | N-[(S)-1-(11-Amino-undecylcarbamoyl)...)
Show SMILES CCCC(=O)N[C@@H](Cc1ccc(O)cc1)C(=O)NCCCCCCCCCCCN
Show InChI InChI=1S/C24H41N3O3/c1-2-12-23(29)27-22(19-20-13-15-21(28)16-14-20)24(30)26-18-11-9-7-5-3-4-6-8-10-17-25/h13-16,22,28H,2-12,17-19,25H2,1H3,(H,26,30)(H,27,29)/t22-/m0/s1
Reactome pathway
n/an/a 580n/an/an/an/an/an/a
The Royal Danish School of Pharmacy
Curated by ChEMBL
Assay Description
Compound was evaluated for inhibitory activity against human embryonic muscle type Nicotinic acetylcholine receptor specifically delta-subunit expres...
Bioorg Med Chem Lett 12: 1159-62 (2002)
BindingDB Entry DOI: 10.7270/Q2BC3XWG