null
SMILES: N#Cc1cccc(c1)-c1cc(ncn1)-c1ccncn1
InChI Key: InChIKey=AMKOCUCZZIHADS-UHFFFAOYSA-N
Activity Spreadsheet -- Enzyme Inhibition Constant Data from BindingDB
Found 2 hits for monomerid = 50113481
Trg + Lig
Ki
nM
ΔG°
kcal/mole
IC50
nM
Kd
nM
EC50/IC50
nM
koff
s-1
kon
M-1s-1
pHTemp
°C
Metabotropic glutamate receptor 5
(Homo sapiens (Human))
BDBM50113481
(CHEMBL3603928)
Show SMILES N#Cc1cccc(c1)-c1cc(ncn1)-c1ccncn1
Show InChI InChI=1S/C15H9N5/c16-8-11-2-1-3-12(6-11)14-7-15(20-10-19-14)13-4-5-17-9-18-13/h1-7,9-10H
5n/an/an/an/an/an/an/an/a
Heptares Therapeutics Ltd.
Curated by ChEMBL
Assay Description
Displacement of [3H]-M-MPEP from human mGlu5 receptor expressed in HEK293 cells after 90 mins by scintillation spectroscopy analysis
J Med Chem 58: 6653-64 (2015)
BindingDB Entry DOI: 10.7270/Q2H70HMZ
Metabotropic glutamate receptor 5
(Homo sapiens (Human))
BDBM50113481
(CHEMBL3603928)
Show SMILES N#Cc1cccc(c1)-c1cc(ncn1)-c1ccncn1
Show InChI InChI=1S/C15H9N5/c16-8-11-2-1-3-12(6-11)14-7-15(20-10-19-14)13-4-5-17-9-18-13/h1-7,9-10H
n/an/a 32n/an/an/an/an/an/a
Heptares Therapeutics Ltd.
Curated by ChEMBL
Assay Description
Negative allosteric modulation at human mGlu5 receptor expressed in HEK293 cells assessed as inhibition of L-quisqualic acid-induced inositol phospha...
J Med Chem 58: 6653-64 (2015)
BindingDB Entry DOI: 10.7270/Q2H70HMZ