BDBM50113730 2-[6-(4-Amino-3-chloro-phenylamino)-9-isopropyl-9H-purin-2-ylamino]-3-methyl-butan-1-ol::CHEMBL78214
SMILES: CC(C)[C@H](CO)Nc1nc(Nc2ccc(N)c(Cl)c2)c2ncn(C(C)C)c2n1
InChI Key: InChIKey=AIKLCVAETRXWOB-HNNXBMFYSA-N
Data: 1 IC50
Activity Spreadsheet -- Enzyme Inhibition Constant Data from BindingDB
Found 1 hit for monomerid = 50113730
Trg + Lig
Ki
nM
ΔG°
kcal/mole
IC50
nM
Kd
nM
EC50/IC50
nM
koff
s-1
kon
M-1s-1
pHTemp
°C
Cyclin-dependent kinase 1
(Homo sapiens (Human))
BDBM50113730
(2-[6-(4-Amino-3-chloro-phenylamino)-9-isopropyl-9H...)
Show SMILES CC(C)[C@H](CO)Nc1nc(Nc2ccc(N)c(Cl)c2)c2ncn(C(C)C)c2n1
Show InChI InChI=1S/C19H26ClN7O/c1-10(2)15(8-28)24-19-25-17(23-12-5-6-14(21)13(20)7-12)16-18(26-19)27(9-22-16)11(3)4/h5-7,9-11,15,28H,8,21H2,1-4H3,(H2,23,24,25,26)/t15-/m0/s1
Reactome pathway
n/an/a 3.30E+7n/an/an/an/an/an/a
Aventis Pharma Deutschland GmbH
Curated by ChEMBL
Assay Description
Binding affinity to cyclin-dependent kinase 1 (CDK1)
J Med Chem 45: 2366-78 (2002)
BindingDB Entry DOI: 10.7270/Q25B01SB