BDBM50115396 CHEMBL3608463
SMILES: OC[C@@H](N1CCCn2cc(cc2C1=O)-c1ccnc(NC2CC3(COC3)C2)n1)c1ccccc1
InChI Key: InChIKey=OWPUQESWKHKBDC-HSZRJFAPSA-N
Data: 1 IC50
Activity Spreadsheet -- Enzyme Inhibition Constant Data from BindingDB
Found 1 hit for monomerid = 50115396
Trg + Lig
Ki
nM
ΔG°
kcal/mole
IC50
nM
Kd
nM
EC50/IC50
nM
koff
s-1
kon
M-1s-1
pHTemp
°C
Mitogen-activated protein kinase 1
(Homo sapiens (Human))
BDBM50115396
(CHEMBL3608463)
Show SMILES OC[C@@H](N1CCCn2cc(cc2C1=O)-c1ccnc(NC2CC3(COC3)C2)n1)c1ccccc1 |r|
Show InChI InChI=1S/C26H29N5O3/c32-15-23(18-5-2-1-3-6-18)31-10-4-9-30-14-19(11-22(30)24(31)33)21-7-8-27-25(29-21)28-20-12-26(13-20)16-34-17-26/h1-3,5-8,11,14,20,23,32H,4,9-10,12-13,15-17H2,(H,27,28,29)/t23-/m1/s1
NCI pathway
Reactome pathway
n/an/a 0.0400n/an/an/an/an/an/a
Novartis Institutes for BioMedical Research
Curated by ChEMBL
Assay Description
Inhibition of ERK2 (unknown origin)
Bioorg Med Chem Lett 25: 3788-92 (2015)
BindingDB Entry DOI: 10.7270/Q2G44S3Q