BDBM50115933 (E)-3-(1-Amino-isoquinolin-7-yl)-2-fluoro-but-2-enoic acid (3-chloro-2'-sulfamoyl-biphenyl-4-yl)-amide::CHEMBL63041
SMILES: C\C(=C(/F)C(=O)Nc1ccc(cc1Cl)-c1ccccc1S(N)(=O)=O)c1ccc2ccnc(N)c2c1
InChI Key: InChIKey=PZQXOASUPDYJBC-OEAKJJBVSA-N
Data: 1 KI  3 IC50
Activity Spreadsheet -- Enzyme Inhibition Constant Data from BindingDB
Found 4 hits for monomerid = 50115933
Trg + Lig
Ki
nM
ΔG°
kcal/mole
IC50
nM
Kd
nM
EC50/IC50
nM
koff
s-1
kon
M-1s-1
pHTemp
°C
Coagulation factor X
(Homo sapiens (Human))
BDBM50115933
((E)-3-(1-Amino-isoquinolin-7-yl)-2-fluoro-but-2-en...)
Show SMILES C\C(=C(/F)C(=O)Nc1ccc(cc1Cl)-c1ccccc1S(N)(=O)=O)c1ccc2ccnc(N)c2c1
Show InChI InChI=1S/C25H20ClFN4O3S/c1-14(16-7-6-15-10-11-30-24(28)19(15)12-16)23(27)25(32)31-21-9-8-17(13-20(21)26)18-4-2-3-5-22(18)35(29,33)34/h2-13H,1H3,(H2,28,30)(H,31,32)(H2,29,33,34)/b23-14+
Reactome pathway
1.10n/an/an/an/an/an/an/an/a
Millennium Pharmaceuticals, Inc.
Curated by ChEMBL
Assay Description
Concentration required for inhibition of Coagulation factor X
Bioorg Med Chem Lett 12: 2043-6 (2002)
BindingDB Entry DOI: 10.7270/Q2PZ584G
Prothrombin
(Homo sapiens (Human))
BDBM50115933
((E)-3-(1-Amino-isoquinolin-7-yl)-2-fluoro-but-2-en...)
Show SMILES C\C(=C(/F)C(=O)Nc1ccc(cc1Cl)-c1ccccc1S(N)(=O)=O)c1ccc2ccnc(N)c2c1
Show InChI InChI=1S/C25H20ClFN4O3S/c1-14(16-7-6-15-10-11-30-24(28)19(15)12-16)23(27)25(32)31-21-9-8-17(13-20(21)26)18-4-2-3-5-22(18)35(29,33)34/h2-13H,1H3,(H2,28,30)(H,31,32)(H2,29,33,34)/b23-14+
n/an/a 5.40E+3n/an/an/an/an/an/a
Millennium Pharmaceuticals, Inc.
Curated by ChEMBL
Assay Description
Concentration of the compound required for inhibition of Coagulation factor II
Bioorg Med Chem Lett 12: 2043-6 (2002)
BindingDB Entry DOI: 10.7270/Q2PZ584G
Coagulation factor X
(Homo sapiens (Human))
BDBM50115933
((E)-3-(1-Amino-isoquinolin-7-yl)-2-fluoro-but-2-en...)
Show SMILES C\C(=C(/F)C(=O)Nc1ccc(cc1Cl)-c1ccccc1S(N)(=O)=O)c1ccc2ccnc(N)c2c1
Show InChI InChI=1S/C25H20ClFN4O3S/c1-14(16-7-6-15-10-11-30-24(28)19(15)12-16)23(27)25(32)31-21-9-8-17(13-20(21)26)18-4-2-3-5-22(18)35(29,33)34/h2-13H,1H3,(H2,28,30)(H,31,32)(H2,29,33,34)/b23-14+
Reactome pathway
n/an/a 11n/an/an/an/an/an/a
Millennium Pharmaceuticals, Inc.
Curated by ChEMBL
Assay Description
Concentration required for inhibition of Coagulation factor X
Bioorg Med Chem Lett 12: 2043-6 (2002)
BindingDB Entry DOI: 10.7270/Q2PZ584G
Trypsin-1
(Homo sapiens (Human))
BDBM50115933
((E)-3-(1-Amino-isoquinolin-7-yl)-2-fluoro-but-2-en...)
Show SMILES C\C(=C(/F)C(=O)Nc1ccc(cc1Cl)-c1ccccc1S(N)(=O)=O)c1ccc2ccnc(N)c2c1
Show InChI InChI=1S/C25H20ClFN4O3S/c1-14(16-7-6-15-10-11-30-24(28)19(15)12-16)23(27)25(32)31-21-9-8-17(13-20(21)26)18-4-2-3-5-22(18)35(29,33)34/h2-13H,1H3,(H2,28,30)(H,31,32)(H2,29,33,34)/b23-14+
Reactome pathway
n/an/a>1.10E+4n/an/an/an/an/an/a
Millennium Pharmaceuticals, Inc.
Curated by ChEMBL
Assay Description
Concentration of the compound required for inhibition of trypsin
Bioorg Med Chem Lett 12: 2043-6 (2002)
BindingDB Entry DOI: 10.7270/Q2PZ584G