BDBM50116031 3,5,6-Trifluoro-4-[4-(4-fluoro-phenyl)-5-pyridin-4-yl-1H-imidazol-2-yl]-pyridin-2-ylamine::CHEMBL306667
SMILES: Nc1nc(F)c(F)c(-c2nc(c([nH]2)-c2ccc(F)cc2)-c2ccncc2)c1F
InChI Key: InChIKey=UNIZPJWWWZTLDS-UHFFFAOYSA-N
Data: 2 IC50
Activity Spreadsheet -- Enzyme Inhibition Constant Data from BindingDB
Found 2 hits for monomerid = 50116031
Trg + Lig
Ki
nM
ΔG°
kcal/mole
IC50
nM
Kd
nM
EC50/IC50
nM
koff
s-1
kon
M-1s-1
pHTemp
°C
Mitogen-activated protein kinase 14
(Mus musculus (mouse))
BDBM50116031
(3,5,6-Trifluoro-4-[4-(4-fluoro-phenyl)-5-pyridin-4...)
Show SMILES Nc1nc(F)c(F)c(-c2nc(c([nH]2)-c2ccc(F)cc2)-c2ccncc2)c1F
Show InChI InChI=1S/C19H11F4N5/c20-11-3-1-9(2-4-11)15-16(10-5-7-25-8-6-10)27-19(26-15)12-13(21)17(23)28-18(24)14(12)22/h1-8H,(H2,24,28)(H,26,27)
Reactome pathway
n/an/a 4n/an/an/an/an/an/a
Novartis Pharma AG
Curated by ChEMBL
Assay Description
In vivo inhibition of murine Mitogen-activated protein kinase p38 alpha activity, GST-ATF-2 as substrate in the presence of 120 microM ATP
Bioorg Med Chem Lett 12: 2109-12 (2002)
BindingDB Entry DOI: 10.7270/Q2610ZNX
Prostaglandin G/H synthase 1
(Ovis aries (Sheep))
BDBM50116031
(3,5,6-Trifluoro-4-[4-(4-fluoro-phenyl)-5-pyridin-4...)
Show SMILES Nc1nc(F)c(F)c(-c2nc(c([nH]2)-c2ccc(F)cc2)-c2ccncc2)c1F
Show InChI InChI=1S/C19H11F4N5/c20-11-3-1-9(2-4-11)15-16(10-5-7-25-8-6-10)27-19(26-15)12-13(21)17(23)28-18(24)14(12)22/h1-8H,(H2,24,28)(H,26,27)
n/an/a 1.00E+5n/an/an/an/an/an/a
Novartis Pharma AG
Curated by ChEMBL
Assay Description
In vivo inhibition of ram seminal vesicle Prostaglandin G/H synthase 1 activity by determining PGE-2 by RIA
Bioorg Med Chem Lett 12: 2109-12 (2002)
BindingDB Entry DOI: 10.7270/Q2610ZNX