BDBM50119673 (R)-5-Benzo[1,3]dioxol-5-yl-2-ethoxymethyl-7-(4-methoxy-phenyl)-6,7-dihydro-5H-[1]pyrindine-6-carboxylic acid::CHEMBL430506
SMILES: CCOCc1ccc2[C@@H]([C@H]([C@@H](c2n1)c1ccc(OC)cc1)C(O)=O)c1ccc2OCOc2c1
InChI Key: InChIKey=ILKUULNNGMUWFG-KMDXXIMOSA-N
Data: 2 IC50
Activity Spreadsheet -- Enzyme Inhibition Constant Data from BindingDB
Found 2 hits for monomerid = 50119673
Trg + Lig
Ki
nM
ΔG°
kcal/mole
IC50
nM
Kd
nM
EC50/IC50
nM
koff
s-1
kon
M-1s-1
pHTemp
°C
Endothelin-1 receptor
(Homo sapiens (Human))
BDBM50119673
((R)-5-Benzo[1,3]dioxol-5-yl-2-ethoxymethyl-7-(4-me...)
Show SMILES CCOCc1ccc2[C@@H]([C@H]([C@@H](c2n1)c1ccc(OC)cc1)C(O)=O)c1ccc2OCOc2c1
Show InChI InChI=1S/C26H25NO6/c1-3-31-13-17-7-10-19-22(16-6-11-20-21(12-16)33-14-32-20)24(26(28)29)23(25(19)27-17)15-4-8-18(30-2)9-5-15/h4-12,22-24H,3,13-14H2,1-2H3,(H,28,29)/t22-,23-,24+/m0/s1
n/an/a 0.510n/an/an/an/an/an/a
Tsukuba Research Institute
Curated by ChEMBL
Assay Description
Inhibitory activity of the compound against I-labeled ET-1 binding to Endothelin A receptor
Bioorg Med Chem Lett 12: 3041-5 (2002)
BindingDB Entry DOI: 10.7270/Q2KK9B3N
EDNRB
(Homo sapiens (Human))
BDBM50119673
((R)-5-Benzo[1,3]dioxol-5-yl-2-ethoxymethyl-7-(4-me...)
Show SMILES CCOCc1ccc2[C@@H]([C@H]([C@@H](c2n1)c1ccc(OC)cc1)C(O)=O)c1ccc2OCOc2c1
Show InChI InChI=1S/C26H25NO6/c1-3-31-13-17-7-10-19-22(16-6-11-20-21(12-16)33-14-32-20)24(26(28)29)23(25(19)27-17)15-4-8-18(30-2)9-5-15/h4-12,22-24H,3,13-14H2,1-2H3,(H,28,29)/t22-,23-,24+/m0/s1
n/an/a 140n/an/an/an/an/an/a
Tsukuba Research Institute
Curated by ChEMBL
Assay Description
Inhibitory activity of the compound against I-labeled ET-1 binding to Endothelin B receptor
Bioorg Med Chem Lett 12: 3041-5 (2002)
BindingDB Entry DOI: 10.7270/Q2KK9B3N