BDBM50120598 CHEMBL564764
SMILES: CCOC(=O)C1=C(C)NC(OC)N(CC(=O)c2ccc(OC)cc2)C1c1ccccc1
InChI Key: InChIKey=CJJAKZOAHJCDRN-UHFFFAOYSA-N
Data: 2 IC50
Activity Spreadsheet -- Enzyme Inhibition Constant Data from BindingDB
Found 2 hits for monomerid = 50120598
Trg + Lig
Ki
nM
ΔG°
kcal/mole
IC50
nM
Kd
nM
EC50/IC50
nM
koff
s-1
kon
M-1s-1
pHTemp
°C
Myosin light chain kinase, smooth muscle
(Homo sapiens (Human))
BDBM50120598
(CHEMBL564764)
Show SMILES CCOC(=O)C1=C(C)NC(OC)N(CC(=O)c2ccc(OC)cc2)C1c1ccccc1 |c:5|
Show InChI InChI=1S/C24H28N2O5/c1-5-31-23(28)21-16(2)25-24(30-4)26(22(21)18-9-7-6-8-10-18)15-20(27)17-11-13-19(29-3)14-12-17/h6-14,22,24-25H,5,15H2,1-4H3
n/an/a 1.33E+11n/an/an/an/an/an/a
Rashtrasant Tukadoji Maharaj Nagpur University
Curated by ChEMBL
Assay Description
Inhibition of MLCK (unknown origin) incubated for 15 mins using [gamma-32P]-ATP by scintillation counting method
Bioorg Med Chem 23: 6689-713 (2015)
BindingDB Entry DOI: 10.7270/Q2P55Q95
Myosin light chain kinase, smooth muscle
(Homo sapiens (Human))
BDBM50120598
(CHEMBL564764)
Show SMILES CCOC(=O)C1=C(C)NC(OC)N(CC(=O)c2ccc(OC)cc2)C1c1ccccc1 |c:5|
Show InChI InChI=1S/C24H28N2O5/c1-5-31-23(28)21-16(2)25-24(30-4)26(22(21)18-9-7-6-8-10-18)15-20(27)17-11-13-19(29-3)14-12-17/h6-14,22,24-25H,5,15H2,1-4H3
n/an/a 1.33E+4n/an/an/an/an/an/a
Rashtrasant Tukadoji Maharaj Nagpur University
Curated by ChEMBL
Assay Description
Inhibition of MLCK (unknown origin) incubated for 15 mins using [gamma-32P]-ATP by scintillation counting method
Bioorg Med Chem 23: 6689-713 (2015)
BindingDB Entry DOI: 10.7270/Q2P55Q95