BDBM50122326 CHEMBL3622143
SMILES: CCn1c(cc2c1nc(Nc1nc(C)c(s1)C(=O)NC)c1ncn(C)c21)C(=O)N(C1CC1)C1CC1
InChI Key: InChIKey=MFVZNKUXWWQCRL-UHFFFAOYSA-N
Data: 3 IC50
Activity Spreadsheet -- Enzyme Inhibition Constant Data from BindingDB
Found 3 hits for monomerid = 50122326
Trg + Lig
Ki
nM
ΔG°
kcal/mole
IC50
nM
Kd
nM
EC50/IC50
nM
koff
s-1
kon
M-1s-1
pHTemp
°C
Tyrosine-protein kinase JAK2
(Homo sapiens (Human))
BDBM50122326
(CHEMBL3622143)
Show SMILES CCn1c(cc2c1nc(Nc1nc(C)c(s1)C(=O)NC)c1ncn(C)c21)C(=O)N(C1CC1)C1CC1
Show InChI InChI=1S/C24H28N8O2S/c1-5-31-16(23(34)32(13-6-7-13)14-8-9-14)10-15-18-17(26-11-30(18)4)20(28-21(15)31)29-24-27-12(2)19(35-24)22(33)25-3/h10-11,13-14H,5-9H2,1-4H3,(H,25,33)(H,27,28,29)
Reactome pathway
n/an/a 0.900n/an/an/an/an/an/a
Bristol-Myers Squibb R&D
Curated by ChEMBL
Assay Description
Inhibition of recombinant JAK2 (unknown origin) using 5-FAM-KKKKEEIYFFFG-OH substrate and ATP incubated for 180 mins by scintillation counting method
ACS Med Chem Lett 6: 850-5 (2015)
BindingDB Entry DOI: 10.7270/Q2CJ8G8Z
Tyrosine-protein kinase JAK1
(Homo sapiens (Human))
BDBM50122326
(CHEMBL3622143)
Show SMILES CCn1c(cc2c1nc(Nc1nc(C)c(s1)C(=O)NC)c1ncn(C)c21)C(=O)N(C1CC1)C1CC1
Show InChI InChI=1S/C24H28N8O2S/c1-5-31-16(23(34)32(13-6-7-13)14-8-9-14)10-15-18-17(26-11-30(18)4)20(28-21(15)31)29-24-27-12(2)19(35-24)22(33)25-3/h10-11,13-14H,5-9H2,1-4H3,(H,25,33)(H,27,28,29)
Reactome pathway
n/an/a 19n/an/an/an/an/an/a
Bristol-Myers Squibb R&D
Curated by ChEMBL
Assay Description
Inhibition of recombinant JAK1 (unknown origin) using 5-FAM-KKKKEEIYFFFG-OH substrate and ATP incubated for 180 mins by scintillation counting method
ACS Med Chem Lett 6: 850-5 (2015)
BindingDB Entry DOI: 10.7270/Q2CJ8G8Z
Tyrosine-protein kinase JAK3
(Homo sapiens (Human))
BDBM50122326
(CHEMBL3622143)
Show SMILES CCn1c(cc2c1nc(Nc1nc(C)c(s1)C(=O)NC)c1ncn(C)c21)C(=O)N(C1CC1)C1CC1
Show InChI InChI=1S/C24H28N8O2S/c1-5-31-16(23(34)32(13-6-7-13)14-8-9-14)10-15-18-17(26-11-30(18)4)20(28-21(15)31)29-24-27-12(2)19(35-24)22(33)25-3/h10-11,13-14H,5-9H2,1-4H3,(H,25,33)(H,27,28,29)
Reactome pathway
n/an/a 19n/an/an/an/an/an/a
Bristol-Myers Squibb R&D
Curated by ChEMBL
Assay Description
Inhibition of recombinant JAK3 (unknown origin) using 5-FAM-KKKKEEIYFFFG-OH substrate and ATP incubated for 180 mins by scintillation counting method
ACS Med Chem Lett 6: 850-5 (2015)
BindingDB Entry DOI: 10.7270/Q2CJ8G8Z