BDBM50123062 CHEMBL340158::N-Cyclohexyl-5-[2,6-dichloro-4-(3,5-dioxo-4,5-dihydro-3H-[1,2,4]triazin-2-yl)-phenoxy]-2-hydroxy-benzenesulfonamide::N-cyclohexyl-5-(2,6-dichloro-4-(3,5-dioxo-4,5-dihydro-1,2,4-triazin-2(3H)-yl)phenoxy)-2-hydroxybenzenesulfonamide
SMILES: Oc1ccc(Oc2c(Cl)cc(cc2Cl)-n2ncc(=O)[nH]c2=O)cc1S(=O)(=O)NC1CCCCC1
InChI Key: InChIKey=PRIYYGPQKYVTFA-UHFFFAOYSA-N
Data: 1 KI  1 IC50
Activity Spreadsheet -- Enzyme Inhibition Constant Data from BindingDB
Found 2 hits for monomerid = 50123062
Trg + Lig
Ki
nM
ΔG°
kcal/mole
IC50
nM
Kd
nM
EC50/IC50
nM
koff
s-1
kon
M-1s-1
pHTemp
°C
Thyroid hormone receptor beta
(Homo sapiens (Human))
BDBM50123062
(CHEMBL340158 | N-Cyclohexyl-5-[2,6-dichloro-4-(3,5...)
Show SMILES Oc1ccc(Oc2c(Cl)cc(cc2Cl)-n2ncc(=O)[nH]c2=O)cc1S(=O)(=O)NC1CCCCC1
Show InChI InChI=1S/C21H20Cl2N4O6S/c22-15-8-13(27-21(30)25-19(29)11-24-27)9-16(23)20(15)33-14-6-7-17(28)18(10-14)34(31,32)26-12-4-2-1-3-5-12/h6-12,26,28H,1-5H2,(H,25,29,30)
NCI pathway
Reactome pathway
0.460n/an/an/an/an/an/an/an/a
Pfizer Global Research and Development
Curated by ChEMBL
Assay Description
Inhibitory activity against [125I]-T3 binding to human TRbeta1 receptor
Bioorg Med Chem Lett 13: 379-82 (2003)
BindingDB Entry DOI: 10.7270/Q26T0KZB
Thyroid hormone receptor beta
(Homo sapiens (Human))
BDBM50123062
(CHEMBL340158 | N-Cyclohexyl-5-[2,6-dichloro-4-(3,5...)
Show SMILES Oc1ccc(Oc2c(Cl)cc(cc2Cl)-n2ncc(=O)[nH]c2=O)cc1S(=O)(=O)NC1CCCCC1
Show InChI InChI=1S/C21H20Cl2N4O6S/c22-15-8-13(27-21(30)25-19(29)11-24-27)9-16(23)20(15)33-14-6-7-17(28)18(10-14)34(31,32)26-12-4-2-1-3-5-12/h6-12,26,28H,1-5H2,(H,25,29,30)
NCI pathway
Reactome pathway
n/an/a 1.29n/an/an/an/an/an/a
University of Insubria
Curated by ChEMBL
Assay Description
Inhibition of human thyroid hormone receptor beta 1
Bioorg Med Chem 15: 5251-61 (2007)
Article DOI: 10.1016/j.bmc.2007.05.016
BindingDB Entry DOI: 10.7270/Q2PK0HD8