BDBM50123508 CHEMBL148159::[2'-(2-Pyridin-2-yl-ethylcarbamoyl)-biphenyl-2-ylmethyl]-carbamic acid benzyl ester
SMILES: O=C(NCc1ccccc1-c1ccccc1C(=O)NCCc1ccccn1)OCc1ccccc1
InChI Key: InChIKey=FLOLVFLAXFXKBU-UHFFFAOYSA-N
Data: 3 IC50
Activity Spreadsheet -- Enzyme Inhibition Constant Data from BindingDB
Found 3 hits for monomerid = 50123508
Trg + Lig
Ki
nM
ΔG°
kcal/mole
IC50
nM
Kd
nM
EC50/IC50
nM
koff
s-1
kon
M-1s-1
pHTemp
°C
Voltage-gated potassium channel subunit Kv1.5
(Homo sapiens (Human))
BDBM50123508
(CHEMBL148159 | [2'-(2-Pyridin-2-yl-ethylcarbamoyl)...)
Show SMILES O=C(NCc1ccccc1-c1ccccc1C(=O)NCCc1ccccn1)OCc1ccccc1
Show InChI InChI=1S/C29H27N3O3/c33-28(31-19-17-24-13-8-9-18-30-24)27-16-7-6-15-26(27)25-14-5-4-12-23(25)20-32-29(34)35-21-22-10-2-1-3-11-22/h1-16,18H,17,19-21H2,(H,31,33)(H,32,34)
n/an/a 700n/an/an/an/an/an/a
Aventis Pharma Deutschland GmbH
Curated by ChEMBL
Assay Description
Inhibition of human voltage-gated potassium channel subunit Kv1.5 expressed in Xenopus oocytes
J Med Chem 46: 486-98 (2003)
Article DOI: 10.1021/jm0210461
BindingDB Entry DOI: 10.7270/Q2RJ4HTF
Potassium channel protein TASK-1
(Homo sapiens (Human))
BDBM50123508
(CHEMBL148159 | [2'-(2-Pyridin-2-yl-ethylcarbamoyl)...)
Show SMILES O=C(NCc1ccccc1-c1ccccc1C(=O)NCCc1ccccn1)OCc1ccccc1
Show InChI InChI=1S/C29H27N3O3/c33-28(31-19-17-24-13-8-9-18-30-24)27-16-7-6-15-26(27)25-14-5-4-12-23(25)20-32-29(34)35-21-22-10-2-1-3-11-22/h1-16,18H,17,19-21H2,(H,31,33)(H,32,34)
n/an/a 200n/an/an/an/an/an/a
Universidad de Talca
Curated by ChEMBL
Assay Description
Inhibition of human TASK1 expressed in Xenopus oocytes by whole cell voltage clamp assay
J Med Chem 62: 10044-10058 (2019)
Article DOI: 10.1021/acs.jmedchem.9b00248
Voltage-gated potassium channel
(Homo sapiens (Human))
BDBM50123508
(CHEMBL148159 | [2'-(2-Pyridin-2-yl-ethylcarbamoyl)...)
Show SMILES O=C(NCc1ccccc1-c1ccccc1C(=O)NCCc1ccccn1)OCc1ccccc1
Show InChI InChI=1S/C29H27N3O3/c33-28(31-19-17-24-13-8-9-18-30-24)27-16-7-6-15-26(27)25-14-5-4-12-23(25)20-32-29(34)35-21-22-10-2-1-3-11-22/h1-16,18H,17,19-21H2,(H,31,33)(H,32,34)
Reactome pathway
n/an/a 2.30E+3n/an/an/an/an/an/a
Aventis Pharma Deutschland GmbH
Curated by ChEMBL
Assay Description
Inhibition of human voltage-gated potassium channel subunit Kv1.3 expressed in Xenopus oocytes
J Med Chem 46: 486-98 (2003)
Article DOI: 10.1021/jm0210461
BindingDB Entry DOI: 10.7270/Q2RJ4HTF