BDBM50126854 CHEMBL3628812
SMILES: Clc1ccc(Nc2ncc3CSc4ccccc4-c3n2)cc1
InChI Key: InChIKey=IEPMWOYSCMMVNR-UHFFFAOYSA-N
Data: 1 IC50
Activity Spreadsheet -- Enzyme Inhibition Constant Data from BindingDB
Found 1 hit for monomerid = 50126854
Trg + Lig
Ki
nM
ΔG°
kcal/mole
IC50
nM
Kd
nM
EC50/IC50
nM
koff
s-1
kon
M-1s-1
pHTemp
°C
Vascular endothelial growth factor receptor 2
(Homo sapiens (Human))
BDBM50126854
(CHEMBL3628812)
Show SMILES Clc1ccc(Nc2ncc3CSc4ccccc4-c3n2)cc1
Show InChI InChI=1S/C17H12ClN3S/c18-12-5-7-13(8-6-12)20-17-19-9-11-10-22-15-4-2-1-3-14(15)16(11)21-17/h1-9H,10H2,(H,19,20,21)
NCI pathway
Reactome pathway
n/an/a>5.00E+4n/an/an/an/an/an/a
Universit£ di Pisa
Curated by ChEMBL
Assay Description
Inhibition of human KDR incubated for 50 mins by omnia tyr peptide 8 substrate based fluorescence assay
Eur J Med Chem 103: 29-43 (2015)
BindingDB Entry DOI: 10.7270/Q2G162MG