null
SMILES: c1cc([nH]n1)-c1c[nH]c2ncc(nc12)-c1ccncc1
InChI Key: InChIKey=BMEXQXFYACYCQJ-UHFFFAOYSA-N
Activity Spreadsheet -- Enzyme Inhibition Constant Data from BindingDB
Found 1 hit for monomerid = 50127086
Trg + Lig
Ki
nM
ΔG°
kcal/mole
IC50
nM
Kd
nM
EC50/IC50
nM
koff
s-1
kon
M-1s-1
pHTemp
°C
Mitogen-activated protein kinase 1
(Homo sapiens (Human))
BDBM50127086
(CHEMBL3628374)
Show SMILES c1cc([nH]n1)-c1c[nH]c2ncc(nc12)-c1ccncc1
Show InChI InChI=1S/C14H10N6/c1-4-15-5-2-9(1)12-8-17-14-13(19-12)10(7-16-14)11-3-6-18-20-11/h1-8H,(H,16,17)(H,18,20)
NCI pathway
Reactome pathway
n/an/a 940n/an/an/an/an/an/a
Genentech
Curated by ChEMBL
Assay Description
Inhibition of ERK2 (unknown origin) using 5FAM-IPTSPITTTYFFFKKK as substrate after 1 hr by LC3K assay
Bioorg Med Chem Lett 25: 4728-32 (2015)
BindingDB Entry DOI: 10.7270/Q2TB18QM