BDBM50129788 2-(4-Aminophenyl)-6-methylbenzothiazole::4-(6-Methyl-benzothiazol-2-yl)-phenylamine::CHEMBL93109::cid_7087
SMILES: Cc1ccc2nc(sc2c1)-c1ccc(N)cc1
InChI Key: InChIKey=XRTJYEIMLZALBD-UHFFFAOYSA-N
Data: 1 KI  1 EC50
Activity Spreadsheet -- Enzyme Inhibition Constant Data from BindingDB
Found 2 hits for monomerid = 50129788
Trg + Lig
Ki
nM
ΔG°
kcal/mole
IC50
nM
Kd
nM
EC50/IC50
nM
koff
s-1
kon
M-1s-1
pHTemp
°C
Beta amyloid A4 protein
(Homo sapiens (Human))
BDBM50129788
(2-(4-Aminophenyl)-6-methylbenzothiazole | 4-(6-Met...)
Show SMILES Cc1ccc2nc(sc2c1)-c1ccc(N)cc1
Show InChI InChI=1S/C14H12N2S/c1-9-2-7-12-13(8-9)17-14(16-12)10-3-5-11(15)6-4-10/h2-8H,15H2,1H3
Reactome pathway
9.5n/an/an/an/an/an/an/an/a
University of Pittsburgh
Curated by ChEMBL
Assay Description
Binding affinity for Amyloid beta 1-40 aggregates in competition with [N-methyl-3H] BTA-1.
J Med Chem 46: 2740-54 (2003)
Article DOI: 10.1021/jm030026b
BindingDB Entry DOI: 10.7270/Q23R0S87
streptokinase A precursor
(Streptococcus pyogenes M1 GAS)
BDBM50129788
(2-(4-Aminophenyl)-6-methylbenzothiazole | 4-(6-Met...)
Show SMILES Cc1ccc2nc(sc2c1)-c1ccc(N)cc1
Show InChI InChI=1S/C14H12N2S/c1-9-2-7-12-13(8-9)17-14(16-12)10-3-5-11(15)6-4-10/h2-8H,15H2,1H3
PCBioAssay
n/an/an/an/a 1.50E+5n/an/an/an/a
Broad Institute
Curated by PubChem BioAssay
Assay Description
Keywords: Group A streptococcus, GAS, streptokinase, expression, virulence, inhibition, dose response, EC50 Assay Overview: The goal of this assa...
PubChem Bioassay (2009)
BindingDB Entry DOI: 10.7270/Q2736PBV