BDBM50130018 8-Oxo-2-(pyridin-2-ylmethoxy)-7-pyridin-2-ylmethyl-5-(3,4,5-trimethoxy-phenyl)-7,8-dihydro-[1,7]naphthyridine-6-carboxylic acid methyl ester with 2moles of hydrochloride::CHEMBL539778
SMILES: COC(=O)c1c(-c2cc(OC)c(OC)c(OC)c2)c2ccc(OCc3ccccn3)nc2c(=O)n1Cc1ccccn1
InChI Key: InChIKey=ZODMRNAOOZTKSY-UHFFFAOYSA-N
Data: 3 IC50
Activity Spreadsheet -- Enzyme Inhibition Constant Data from BindingDB
Found 3 hits for monomerid = 50130018
Trg + Lig
Ki
nM
ΔG°
kcal/mole
IC50
nM
Kd
nM
EC50/IC50
nM
koff
s-1
kon
M-1s-1
pHTemp
°C
cGMP-specific 3',5'-cyclic phosphodiesterase
(Canis lupus familiaris)
BDBM50130018
(8-Oxo-2-(pyridin-2-ylmethoxy)-7-pyridin-2-ylmethyl...)
Show SMILES COC(=O)c1c(-c2cc(OC)c(OC)c(OC)c2)c2ccc(OCc3ccccn3)nc2c(=O)n1Cc1ccccn1
Show InChI InChI=1S/C31H28N4O7/c1-38-23-15-19(16-24(39-2)29(23)40-3)26-22-11-12-25(42-18-21-10-6-8-14-33-21)34-27(22)30(36)35(28(26)31(37)41-4)17-20-9-5-7-13-32-20/h5-16H,17-18H2,1-4H3
Reactome pathway
n/an/a 11n/an/an/an/an/an/a
Tanabe Seiyaku Co., Ltd.
Curated by ChEMBL
Assay Description
Inhibitory activity against phosphodiesterase 5 (PDE5) isolated from canine lung
Bioorg Med Chem Lett 13: 2341-5 (2003)
BindingDB Entry DOI: 10.7270/Q2WQ04B2
Phosphodiesterase 1
(Homo sapiens (Human))
BDBM50130018
(8-Oxo-2-(pyridin-2-ylmethoxy)-7-pyridin-2-ylmethyl...)
Show SMILES COC(=O)c1c(-c2cc(OC)c(OC)c(OC)c2)c2ccc(OCc3ccccn3)nc2c(=O)n1Cc1ccccn1
Show InChI InChI=1S/C31H28N4O7/c1-38-23-15-19(16-24(39-2)29(23)40-3)26-22-11-12-25(42-18-21-10-6-8-14-33-21)34-27(22)30(36)35(28(26)31(37)41-4)17-20-9-5-7-13-32-20/h5-16H,17-18H2,1-4H3
n/an/a 2.00E+4n/an/an/an/an/an/a
Tanabe Seiyaku Co., Ltd.
Curated by ChEMBL
Assay Description
Inhibitory activity against phosphodiesterase-1 (PDE1) isolated from canine lung
Bioorg Med Chem Lett 13: 2341-5 (2003)
BindingDB Entry DOI: 10.7270/Q2WQ04B2
Phosphodiesterase 6
(Bos taurus-Bos taurus (Bovine))
BDBM50130018
(8-Oxo-2-(pyridin-2-ylmethoxy)-7-pyridin-2-ylmethyl...)
Show SMILES COC(=O)c1c(-c2cc(OC)c(OC)c(OC)c2)c2ccc(OCc3ccccn3)nc2c(=O)n1Cc1ccccn1
Show InChI InChI=1S/C31H28N4O7/c1-38-23-15-19(16-24(39-2)29(23)40-3)26-22-11-12-25(42-18-21-10-6-8-14-33-21)34-27(22)30(36)35(28(26)31(37)41-4)17-20-9-5-7-13-32-20/h5-16H,17-18H2,1-4H3
n/an/a 230n/an/an/an/an/an/a
Tanabe Seiyaku Co., Ltd.
Curated by ChEMBL
Assay Description
Inhibitory activity against Phosphodiesterase 6 isolated from bovine retina
Bioorg Med Chem Lett 13: 2341-5 (2003)
BindingDB Entry DOI: 10.7270/Q2WQ04B2