BDBM50130372 4-[1-Amino-1-(3-methyl-3H-imidazol-4-yl)-ethyl]-2-[3-(3-cyclopropylmethyl-1-methyl-2-oxo-azepan-3-yl)-phenoxy]-benzonitrile::CHEMBL450336
SMILES: CN1CCCC[C@@](CC2CC2)(c2cccc(Oc3cc(ccc3C#N)[C@](C)(N)c3cncn3C)c2)C1=O
InChI Key: InChIKey=XUQVGNQCLMEBOL-XZWHSSHBSA-N
Data: 2 IC50  2 EC50
Activity Spreadsheet -- Enzyme Inhibition Constant Data from BindingDB
Found 4 hits for monomerid = 50130372
Trg + Lig
Ki
nM
ΔG°
kcal/mole
IC50
nM
Kd
nM
EC50/IC50
nM
koff
s-1
kon
M-1s-1
pHTemp
°C
Protein Farnesyltransferase (PFT)
(Homo sapiens (Human))
BDBM50130372
(4-[1-Amino-1-(3-methyl-3H-imidazol-4-yl)-ethyl]-2-...)
Show SMILES CN1CCCC[C@@](CC2CC2)(c2cccc(Oc3cc(ccc3C#N)[C@](C)(N)c3cncn3C)c2)C1=O
Show InChI InChI=1S/C30H35N5O2/c1-29(32,27-19-33-20-35(27)3)23-12-11-22(18-31)26(16-23)37-25-8-6-7-24(15-25)30(17-21-9-10-21)13-4-5-14-34(2)28(30)36/h6-8,11-12,15-16,19-21H,4-5,9-10,13-14,17,32H2,1-3H3/t29-,30+/m0/s1
Reactome pathway
n/an/a 0.300n/an/an/an/an/an/a
Merck Research Laboratories
Curated by ChEMBL
Assay Description
Concentration required to inhibit recombinant human farnesyltransferase (FTase) catalyzed incorporation of [3H]FPP into recombinant Ras-CVIM.
J Med Chem 46: 2973-84 (2003)
Article DOI: 10.1021/jm020587n
BindingDB Entry DOI: 10.7270/Q26Q1Z0P
Protein Farnesyltransferase (PFT)
(Homo sapiens (Human))
BDBM50130372
(4-[1-Amino-1-(3-methyl-3H-imidazol-4-yl)-ethyl]-2-...)
Show SMILES CN1CCCC[C@@](CC2CC2)(c2cccc(Oc3cc(ccc3C#N)[C@](C)(N)c3cncn3C)c2)C1=O
Show InChI InChI=1S/C30H35N5O2/c1-29(32,27-19-33-20-35(27)3)23-12-11-22(18-31)26(16-23)37-25-8-6-7-24(15-25)30(17-21-9-10-21)13-4-5-14-34(2)28(30)36/h6-8,11-12,15-16,19-21H,4-5,9-10,13-14,17,32H2,1-3H3/t29-,30+/m0/s1
Reactome pathway
n/an/an/an/a 1.5n/an/an/an/a
Merck Research Laboratories
Curated by ChEMBL
Assay Description
Inhibition of hDJ2 protein farnesylation
J Med Chem 46: 2973-84 (2003)
Article DOI: 10.1021/jm020587n
BindingDB Entry DOI: 10.7270/Q26Q1Z0P
Geranylgeranyl transferase type I beta subunit/Protein Farnesyltransferase (PFT)
(Homo sapiens (Human))
BDBM50130372
(4-[1-Amino-1-(3-methyl-3H-imidazol-4-yl)-ethyl]-2-...)
Show SMILES CN1CCCC[C@@](CC2CC2)(c2cccc(Oc3cc(ccc3C#N)[C@](C)(N)c3cncn3C)c2)C1=O
Show InChI InChI=1S/C30H35N5O2/c1-29(32,27-19-33-20-35(27)3)23-12-11-22(18-31)26(16-23)37-25-8-6-7-24(15-25)30(17-21-9-10-21)13-4-5-14-34(2)28(30)36/h6-8,11-12,15-16,19-21H,4-5,9-10,13-14,17,32H2,1-3H3/t29-,30+/m0/s1
n/an/a 2.10n/an/an/an/an/an/a
Merck Research Laboratories
Curated by ChEMBL
Assay Description
Concentration required to inhibit recombinant human geranylgeranyl transferase type I (GGTase-I) catalyzed incorporation of [3H]GGPP to the C-terminu...
J Med Chem 46: 2973-84 (2003)
Article DOI: 10.1021/jm020587n
BindingDB Entry DOI: 10.7270/Q26Q1Z0P
Geranylgeranyl transferase type I beta subunit/Protein Farnesyltransferase (PFT)
(Homo sapiens (Human))
BDBM50130372
(4-[1-Amino-1-(3-methyl-3H-imidazol-4-yl)-ethyl]-2-...)
Show SMILES CN1CCCC[C@@](CC2CC2)(c2cccc(Oc3cc(ccc3C#N)[C@](C)(N)c3cncn3C)c2)C1=O
Show InChI InChI=1S/C30H35N5O2/c1-29(32,27-19-33-20-35(27)3)23-12-11-22(18-31)26(16-23)37-25-8-6-7-24(15-25)30(17-21-9-10-21)13-4-5-14-34(2)28(30)36/h6-8,11-12,15-16,19-21H,4-5,9-10,13-14,17,32H2,1-3H3/t29-,30+/m0/s1
n/an/an/an/a 87n/an/an/an/a
Merck Research Laboratories
Curated by ChEMBL
Assay Description
Inhibition of Rap1a protein geranylgeranylation in human PSN1 cells
J Med Chem 46: 2973-84 (2003)
Article DOI: 10.1021/jm020587n
BindingDB Entry DOI: 10.7270/Q26Q1Z0P