BDBM50130785 CHEMBL542453::CHEMBL609978::{4-[6-(Allyl-methyl-amino)-hexyloxy]-phenyl}-(4-nitro-phenyl)-methanone; hydrochloride
SMILES: CN(CCCCCCOc1ccc(cc1)C(=O)c1ccc(cc1)[N+]([O-])=O)CC=C
InChI Key: InChIKey=BNDINYCKDZKZEG-UHFFFAOYSA-N
Data: 2 IC50
Activity Spreadsheet -- Enzyme Inhibition Constant Data from BindingDB
Found 2 hits for monomerid = 50130785
Trg + Lig
Ki
nM
ΔG°
kcal/mole
IC50
nM
Kd
nM
EC50/IC50
nM
koff
s-1
kon
M-1s-1
pHTemp
°C
Lanosterol synthase
(Homo sapiens (Human))
BDBM50130785
(CHEMBL542453 | CHEMBL609978 | {4-[6-(Allyl-methyl-...)
Show SMILES CN(CCCCCCOc1ccc(cc1)C(=O)c1ccc(cc1)[N+]([O-])=O)CC=C
Show InChI InChI=1S/C23H28N2O4/c1-3-16-24(2)17-6-4-5-7-18-29-22-14-10-20(11-15-22)23(26)19-8-12-21(13-9-19)25(27)28/h3,8-15H,1,4-7,16-18H2,2H3
Reactome pathway
n/an/a 1.90n/an/an/an/an/an/a
Universit£ di Torino
Curated by ChEMBL
Assay Description
Inhibition of oxidosqualene cyclase
J Med Chem 50: 5039-42 (2007)
Article DOI: 10.1021/jm0704651
BindingDB Entry DOI: 10.7270/Q2ZP47FF
Lanosterol synthase
(Homo sapiens (Human))
BDBM50130785
(CHEMBL542453 | CHEMBL609978 | {4-[6-(Allyl-methyl-...)
Show SMILES CN(CCCCCCOc1ccc(cc1)C(=O)c1ccc(cc1)[N+]([O-])=O)CC=C
Show InChI InChI=1S/C23H28N2O4/c1-3-16-24(2)17-6-4-5-7-18-29-22-14-10-20(11-15-22)23(26)19-8-12-21(13-9-19)25(27)28/h3,8-15H,1,4-7,16-18H2,2H3
Reactome pathway
n/an/a 1.90n/an/an/an/an/an/a
F. Hoffmann-La Roche Ltd.
Curated by ChEMBL
Assay Description
In vitro inhibition of human 2,3-oxidosqualene cyclase.
J Med Chem 46: 3354-70 (2003)
Article DOI: 10.1021/jm021120f
BindingDB Entry DOI: 10.7270/Q29G5NKM