BDBM50135519 (R)-5-{(6S,11S)-6,11-Dihydroxy-11-[(2S,5S)-5-((S)-1-hydroxy-tridecyl)-tetrahydro-furan-2-yl]-undecyl}-3-(2-oxo-propyl)-dihydro-furan-2-one::CHEMBL131124
SMILES: CCCCCCCCCCCC[C@H](O)[C@@H]1CC[C@H](O1)[C@@H](O)CCCC[C@@H](O)CCCCC[C@@H]1CC(CC(C)=O)C(=O)O1
InChI Key: InChIKey=DGQPZGGOYKKJLX-LJFNOIKGSA-N
Data: 1 IC50
Activity Spreadsheet -- Enzyme Inhibition Constant Data from BindingDB
Found 1 hit for monomerid = 50135519
Trg + Lig
Ki
nM
ΔG°
kcal/mole
IC50
nM
Kd
nM
EC50/IC50
nM
koff
s-1
kon
M-1s-1
pHTemp
°C
Mitochondrial complex I; NADH oxidoreductase
(Bos taurus)
BDBM50135519
((R)-5-{(6S,11S)-6,11-Dihydroxy-11-[(2S,5S)-5-((S)-...)
Show SMILES CCCCCCCCCCCC[C@H](O)[C@@H]1CC[C@H](O1)[C@@H](O)CCCC[C@@H](O)CCCCC[C@@H]1CC(CC(C)=O)C(=O)O1
Show InChI InChI=1S/C35H64O7/c1-3-4-5-6-7-8-9-10-11-15-21-31(38)33-23-24-34(42-33)32(39)22-17-16-19-29(37)18-13-12-14-20-30-26-28(25-27(2)36)35(40)41-30/h28-34,37-39H,3-26H2,1-2H3/t28?,29-,30+,31-,32-,33-,34-/m0/s1
n/an/a 3.30n/an/an/an/an/an/a
Universidad de Valencia
Curated by ChEMBL
Assay Description
Inhibitory activity against NADH oxidase in beef heart mitochondrial complex I.
Bioorg Med Chem Lett 13: 4101-5 (2003)
BindingDB Entry DOI: 10.7270/Q2G44PQJ