BDBM50136352 CHEMBL3753931
SMILES: CC(C)Nc1cc(cc(C)n1)-c1nc(no1)-c1cc(F)c(OC[C@H](N)CO)cc1Cl
InChI Key: InChIKey=GNMILZQJXYJNLC-CYBMUJFWSA-N
Data: 1 EC50
Activity Spreadsheet -- Enzyme Inhibition Constant Data from BindingDB
Found 1 hit for monomerid = 50136352
Trg + Lig
Ki
nM
ΔG°
kcal/mole
IC50
nM
Kd
nM
EC50/IC50
nM
koff
s-1
kon
M-1s-1
pHTemp
°C
Sphingosine 1-phosphate receptor 1
(Homo sapiens (Human))
BDBM50136352
(CHEMBL3753931)
Show SMILES CC(C)Nc1cc(cc(C)n1)-c1nc(no1)-c1cc(F)c(OC[C@H](N)CO)cc1Cl |r|
Show InChI InChI=1S/C20H23ClFN5O3/c1-10(2)24-18-5-12(4-11(3)25-18)20-26-19(27-30-20)14-6-16(22)17(7-15(14)21)29-9-13(23)8-28/h4-7,10,13,28H,8-9,23H2,1-3H3,(H,24,25)/t13-/m1/s1
Reactome pathway
n/an/an/an/a 4n/an/an/an/a
Boehringer Ingelheim Pharmaceuticals
Curated by ChEMBL
Assay Description
Agonist activity at human S1P1 receptor expressed in EDG1-bla U2OS cells incubated for 18 hrs prior to GenBlazer substrate addition by beta-arrestin ...
Bioorg Med Chem Lett 26: 466-71 (2016)
BindingDB Entry DOI: 10.7270/Q2GX4DD4