BDBM50136537 CHEMBL3754020
SMILES: CC(C)Nc1cc(cc(C)n1)-c1nnc(s1)-c1cc(F)c(O[C@H]2COC[C@H]2O)cc1Cl
InChI Key: InChIKey=CHPSZIOBBIFCFX-AEFFLSMTSA-N
Data: 1 EC50
Activity Spreadsheet -- Enzyme Inhibition Constant Data from BindingDB
Found 1 hit for monomerid = 50136537
Trg + Lig
Ki
nM
ΔG°
kcal/mole
IC50
nM
Kd
nM
EC50/IC50
nM
koff
s-1
kon
M-1s-1
pHTemp
°C
Sphingosine 1-phosphate receptor 1
(Homo sapiens (Human))
BDBM50136537
(CHEMBL3754020)
Show SMILES CC(C)Nc1cc(cc(C)n1)-c1nnc(s1)-c1cc(F)c(O[C@H]2COC[C@H]2O)cc1Cl |r|
Show InChI InChI=1S/C21H22ClFN4O3S/c1-10(2)24-19-5-12(4-11(3)25-19)20-26-27-21(31-20)13-6-15(23)17(7-14(13)22)30-18-9-29-8-16(18)28/h4-7,10,16,18,28H,8-9H2,1-3H3,(H,24,25)/t16-,18+/m1/s1
Reactome pathway
n/an/an/an/a 147n/an/an/an/a
Boehringer Ingelheim Pharmaceuticals
Curated by ChEMBL
Assay Description
Agonist activity at human S1P1 receptor expressed in EDG1-bla U2OS cells incubated for 18 hrs prior to GenBlazer substrate addition by beta-arrestin ...
Bioorg Med Chem Lett 26: 466-71 (2016)
BindingDB Entry DOI: 10.7270/Q2GX4DD4