BDBM50137397 CHEMBL341014::[(S)-1-((S)-1-Benzyl-2-oxo-ethylcarbamoyl)-3-methyl-butyl]-carbamic acid benzyl ester
SMILES: CC(C)C[C@H](NC(=O)OCc1ccccc1)C(=O)N[C@@H](Cc1ccccc1)C=O
InChI Key: InChIKey=CSKGFHNQMOIAFM-SFTDATJTSA-N
Data: 1 KI  2 IC50
Activity Spreadsheet -- Enzyme Inhibition Constant Data from BindingDB
Found 3 hits for monomerid = 50137397
Trg + Lig
Ki
nM
ΔG°
kcal/mole
IC50
nM
Kd
nM
EC50/IC50
nM
koff
s-1
kon
M-1s-1
pHTemp
°C
Procathepsin L
(Homo sapiens (Human))
BDBM50137397
(CHEMBL341014 | [(S)-1-((S)-1-Benzyl-2-oxo-ethylcar...)
Show SMILES CC(C)C[C@H](NC(=O)OCc1ccccc1)C(=O)N[C@@H](Cc1ccccc1)C=O
Show InChI InChI=1S/C23H28N2O4/c1-17(2)13-21(25-23(28)29-16-19-11-7-4-8-12-19)22(27)24-20(15-26)14-18-9-5-3-6-10-18/h3-12,15,17,20-21H,13-14,16H2,1-2H3,(H,24,27)(H,25,28)/t20-,21-/m0/s1
Reactome pathway
20n/an/an/an/an/an/an/an/a
Amgen Inc.
Curated by ChEMBL
Assay Description
Inhibitory activity against recombinant human cathepsin L
Bioorg Med Chem Lett 14: 87-90 (2003)
BindingDB Entry DOI: 10.7270/Q2930SKK
Calpain 1/small subunit 1
(Homo sapiens (Human))
BDBM50137397
(CHEMBL341014 | [(S)-1-((S)-1-Benzyl-2-oxo-ethylcar...)
Show SMILES CC(C)C[C@H](NC(=O)OCc1ccccc1)C(=O)N[C@@H](Cc1ccccc1)C=O
Show InChI InChI=1S/C23H28N2O4/c1-17(2)13-21(25-23(28)29-16-19-11-7-4-8-12-19)22(27)24-20(15-26)14-18-9-5-3-6-10-18/h3-12,15,17,20-21H,13-14,16H2,1-2H3,(H,24,27)(H,25,28)/t20-,21-/m0/s1
Reactome pathway
n/an/a 35n/an/an/an/an/an/a
TBA
Curated by ChEMBL
Assay Description
Inhibition of Calpain 1 by [3H]-acetyl-casein assay
Bioorg Med Chem Lett 5: 393-398 (1995)
Article DOI: 10.1016/0960-894X(95)00042-R
BindingDB Entry DOI: 10.7270/Q2WQ03R1
Calpain1
(Homo sapiens (Human))
BDBM50137397
(CHEMBL341014 | [(S)-1-((S)-1-Benzyl-2-oxo-ethylcar...)
Show SMILES CC(C)C[C@H](NC(=O)OCc1ccccc1)C(=O)N[C@@H](Cc1ccccc1)C=O
Show InChI InChI=1S/C23H28N2O4/c1-17(2)13-21(25-23(28)29-16-19-11-7-4-8-12-19)22(27)24-20(15-26)14-18-9-5-3-6-10-18/h3-12,15,17,20-21H,13-14,16H2,1-2H3,(H,24,27)(H,25,28)/t20-,21-/m0/s1
Reactome pathway
n/an/a 10n/an/an/an/an/an/a
TBA
Curated by ChEMBL
Assay Description
Inhibitory activity evaluated against recombinant human calpain 1
Bioorg Med Chem Lett 7: 539-544 (1997)
Article DOI: 10.1016/S0960-894X(97)00063-2
BindingDB Entry DOI: 10.7270/Q2W37WBM