BDBM50137713 (S)-2-((S)-3-{[(1S,5S,6R)-4-Fluoro-2-((S)-3-methyl-2-{(S)-3-methyl-2-[(pyrazine-2-carbonyl)-amino]-butyrylamino}-butyryl)-octahydro-cyclopenta[c]pyrrole-1-carbonyl]-amino}-2-oxo-hexanoylamino)-3-phenyl-propionic acid::CHEMBL83596
SMILES: CCCC(NC(=O)[C@@H]1[C@H]2CC[C@H](F)[C@H]2CN1C(=O)[C@@H](NC(=O)[C@@H](NC(=O)c1cnccn1)C(C)C)C(C)C)C(=O)C(=O)N[C@@H](Cc1ccccc1)C(O)=O
InChI Key: InChIKey=ALPUQHJLNNLOIY-AONPDKIXSA-N
Data: 1 KI  1 IC50
Activity Spreadsheet -- Enzyme Inhibition Constant Data from BindingDB
Found 2 hits for monomerid = 50137713
Trg + Lig
Ki
nM
ΔG°
kcal/mole
IC50
nM
Kd
nM
EC50/IC50
nM
koff
s-1
kon
M-1s-1
pHTemp
°C
Human rhinovirus A protease
(Human rhinovirus B)
BDBM50137713
((S)-2-((S)-3-{[(1S,5S,6R)-4-Fluoro-2-((S)-3-methyl...)
Show SMILES CCCC(NC(=O)[C@@H]1[C@H]2CC[C@H](F)[C@H]2CN1C(=O)[C@@H](NC(=O)[C@@H](NC(=O)c1cnccn1)C(C)C)C(C)C)C(=O)C(=O)N[C@@H](Cc1ccccc1)C(O)=O
Show InChI InChI=1S/C38H50FN7O8/c1-6-10-26(32(47)36(51)43-27(38(53)54)17-22-11-8-7-9-12-22)42-35(50)31-23-13-14-25(39)24(23)19-46(31)37(52)30(21(4)5)45-34(49)29(20(2)3)44-33(48)28-18-40-15-16-41-28/h7-9,11-12,15-16,18,20-21,23-27,29-31H,6,10,13-14,17,19H2,1-5H3,(H,42,50)(H,43,51)(H,44,48)(H,45,49)(H,53,54)/t23-,24-,25-,26?,27-,29-,30-,31-/m0/s1
82n/an/an/an/an/an/an/an/a
Lilly Research Laboratory
Curated by ChEMBL
Assay Description
Binding affinity towards Protease using PNA assay in rats
Bioorg Med Chem Lett 14: 251-6 (2003)
BindingDB Entry DOI: 10.7270/Q24B30R9
Human rhinovirus A protease
(Human rhinovirus B)
BDBM50137713
((S)-2-((S)-3-{[(1S,5S,6R)-4-Fluoro-2-((S)-3-methyl...)
Show SMILES CCCC(NC(=O)[C@@H]1[C@H]2CC[C@H](F)[C@H]2CN1C(=O)[C@@H](NC(=O)[C@@H](NC(=O)c1cnccn1)C(C)C)C(C)C)C(=O)C(=O)N[C@@H](Cc1ccccc1)C(O)=O
Show InChI InChI=1S/C38H50FN7O8/c1-6-10-26(32(47)36(51)43-27(38(53)54)17-22-11-8-7-9-12-22)42-35(50)31-23-13-14-25(39)24(23)19-46(31)37(52)30(21(4)5)45-34(49)29(20(2)3)44-33(48)28-18-40-15-16-41-28/h7-9,11-12,15-16,18,20-21,23-27,29-31H,6,10,13-14,17,19H2,1-5H3,(H,42,50)(H,43,51)(H,44,48)(H,45,49)(H,53,54)/t23-,24-,25-,26?,27-,29-,30-,31-/m0/s1
n/an/a>1.00E+5n/an/an/an/an/an/a
Lilly Research Laboratory
Curated by ChEMBL
Assay Description
Cytotoxic activity against Protease in rat liver Huh-7 cells
Bioorg Med Chem Lett 14: 251-6 (2003)
BindingDB Entry DOI: 10.7270/Q24B30R9