BDBM50137895 4'-Nitromethanesulfonyl-biphenyl-3-carboxylic acid (naphthalen-1-ylmethyl)-amide::4-Nitromethanesulfonyl-biphenyl-3-carboxylic acid (naphthalene-1-ylmethyl)-amide::CHEMBL366836
SMILES: [O-][N+](=O)CS(=O)(=O)c1ccc(cc1)-c1cccc(c1)C(=O)NCc1cccc2ccccc12
InChI Key: InChIKey=WRJVGCDGUXMKBO-UHFFFAOYSA-N
Data: 1 IC50
Activity Spreadsheet -- Enzyme Inhibition Constant Data from BindingDB
Found 1 hit for monomerid = 50137895
Trg + Lig
Ki
nM
ΔG°
kcal/mole
IC50
nM
Kd
nM
EC50/IC50
nM
koff
s-1
kon
M-1s-1
pHTemp
°C
Replication protein E1
(Human papillomavirus type 11)
BDBM50137895
(4'-Nitromethanesulfonyl-biphenyl-3-carboxylic acid...)
Show SMILES [O-][N+](=O)CS(=O)(=O)c1ccc(cc1)-c1cccc(c1)C(=O)NCc1cccc2ccccc12
Show InChI InChI=1S/C25H20N2O5S/c28-25(26-16-22-9-3-6-19-5-1-2-10-24(19)22)21-8-4-7-20(15-21)18-11-13-23(14-12-18)33(31,32)17-27(29)30/h1-15H,16-17H2,(H,26,28)
n/an/a 630n/an/an/an/an/an/a
Boehringer Ingelheim (Canada) Ltd.
Curated by ChEMBL
Assay Description
Ability to inhibit in vitro ATPase activity of human papillomavirus (HPV6) E1 helicase
J Med Chem 47: 18-21 (2003)
Article DOI: 10.1021/jm034206x
BindingDB Entry DOI: 10.7270/Q23F4P2Q