BDBM50137898 (4'-Benzylcarbamoylmethyl-biphenyl-4-sulfonyl)-acetic acid::CHEMBL173195::[4'-(Benzylcarbamoyl-methyl)-biphenyl-4-sulfonyl]-acetic acid
SMILES: OC(=O)CS(=O)(=O)c1ccc(cc1)-c1ccc(CC(=O)NCc2ccccc2)cc1
InChI Key: InChIKey=WSWYXZAWYBTTJT-UHFFFAOYSA-N
Data: 1 IC50
Activity Spreadsheet -- Enzyme Inhibition Constant Data from BindingDB
Found 1 hit for monomerid = 50137898
Trg + Lig
Ki
nM
ΔG°
kcal/mole
IC50
nM
Kd
nM
EC50/IC50
nM
koff
s-1
kon
M-1s-1
pHTemp
°C
Replication protein E1
(Human papillomavirus type 11)
BDBM50137898
((4'-Benzylcarbamoylmethyl-biphenyl-4-sulfonyl)-ace...)
Show SMILES OC(=O)CS(=O)(=O)c1ccc(cc1)-c1ccc(CC(=O)NCc2ccccc2)cc1
Show InChI InChI=1S/C23H21NO5S/c25-22(24-15-18-4-2-1-3-5-18)14-17-6-8-19(9-7-17)20-10-12-21(13-11-20)30(28,29)16-23(26)27/h1-13H,14-16H2,(H,24,25)(H,26,27)
n/an/a 340n/an/an/an/an/an/a
Boehringer Ingelheim (Canada) Ltd.
Curated by ChEMBL
Assay Description
Ability to inhibit in vitro ATPase activity of human papillomavirus (HPV6) E1 helicase
J Med Chem 47: 18-21 (2003)
Article DOI: 10.1021/jm034206x
BindingDB Entry DOI: 10.7270/Q23F4P2Q