BDBM50138628 2-{4-[(R)-2-Hydroxy-3-(2-methyl-benzothiazol-5-yloxy)-propyl]-piperazin-1-yl}-N-naphthalen-1-yl-acetamide::CHEMBL153426
SMILES: Cc1nc2cc(OC[C@H](O)CN3CCN(CC(=O)Nc4cccc5ccccc45)CC3)ccc2s1
InChI Key: InChIKey=GKUNXANETPTIDW-OAQYLSRUSA-N
Data: 1 IC50
Activity Spreadsheet -- Enzyme Inhibition Constant Data from BindingDB
Found 1 hit for monomerid = 50138628
Trg + Lig
Ki
nM
ΔG°
kcal/mole
IC50
nM
Kd
nM
EC50/IC50
nM
koff
s-1
kon
M-1s-1
pHTemp
°C
Palmitoyl-CoA oxidase
(Rattus norvegicus)
BDBM50138628
(2-{4-[(R)-2-Hydroxy-3-(2-methyl-benzothiazol-5-ylo...)
Show SMILES Cc1nc2cc(OC[C@H](O)CN3CCN(CC(=O)Nc4cccc5ccccc45)CC3)ccc2s1
Show InChI InChI=1S/C27H30N4O3S/c1-19-28-25-15-22(9-10-26(25)35-19)34-18-21(32)16-30-11-13-31(14-12-30)17-27(33)29-24-8-4-6-20-5-2-3-7-23(20)24/h2-10,15,21,32H,11-14,16-18H2,1H3,(H,29,33)/t21-/m1/s1
Reactome pathway
n/an/a 105n/an/an/an/an/an/a
CV Therapeutics
Curated by ChEMBL
Assay Description
Inhibitory activity against Palmitoyl-CoA oxidase to inhibit rat heart mitochondrial Palmitoyl-CoA oxidation.
Bioorg Med Chem Lett 14: 549-52 (2003)
BindingDB Entry DOI: 10.7270/Q2GH9HD4