BDBM50140569 CHEMBL3752995
SMILES: COc1ccccc1N1CCN(CC1)c1cc(nc(NCCC(O)=O)n1)-c1nccs1
InChI Key: InChIKey=CGTZEGZYMMNVOO-UHFFFAOYSA-N
Data: 1 IC50
Activity Spreadsheet -- Enzyme Inhibition Constant Data from BindingDB
Found 1 hit for monomerid = 50140569
Trg + Lig
Ki
nM
ΔG°
kcal/mole
IC50
nM
Kd
nM
EC50/IC50
nM
koff
s-1
kon
M-1s-1
pHTemp
°C
Lysine-specific demethylase 6B
(Homo sapiens (Human))
BDBM50140569
(CHEMBL3752995)
Show SMILES COc1ccccc1N1CCN(CC1)c1cc(nc(NCCC(O)=O)n1)-c1nccs1
Show InChI InChI=1S/C21H24N6O3S/c1-30-17-5-3-2-4-16(17)26-9-11-27(12-10-26)18-14-15(20-22-8-13-31-20)24-21(25-18)23-7-6-19(28)29/h2-5,8,13-14H,6-7,9-12H2,1H3,(H,28,29)(H,23,24,25)
n/an/a 2.10E+3n/an/an/an/an/an/a
Chinese Academy of Sciences
Curated by ChEMBL
Assay Description
Inhibition of JMJD3 (unknown origin) using biotinylated H3K27me3 peptide as substrate after 1 hr by AlphaLISA assay
Bioorg Med Chem Lett 26: 721-5 (2016)
BindingDB Entry DOI: 10.7270/Q2P55QC2