BDBM50141467 (5S,6R,7R)-5-Benzo[1,3]dioxol-5-yl-7-[2-(2-hydroxy-1-methyl-ethoxy)-4-methoxy-phenyl]-2-isopropylamino-6,7-dihydro-5H-[1]pyrindine-6-carboxylic acid::CHEMBL289216
SMILES: COc1ccc([C@H]2[C@@H]([C@H](c3ccc(NC(C)C)nc23)c2ccc3OCOc3c2)C(O)=O)c(OC(C)CO)c1
InChI Key: InChIKey=WERWDDKHJRXHAF-RNGUFSMASA-N
Data: 4 IC50
Activity Spreadsheet -- Enzyme Inhibition Constant Data from BindingDB
Found 4 hits for monomerid = 50141467
Trg + Lig
Ki
nM
ΔG°
kcal/mole
IC50
nM
Kd
nM
EC50/IC50
nM
koff
s-1
kon
M-1s-1
pHTemp
°C
EDNRB
(Homo sapiens (Human))
BDBM50141467
((5S,6R,7R)-5-Benzo[1,3]dioxol-5-yl-7-[2-(2-hydroxy...)
Show SMILES COc1ccc([C@H]2[C@@H]([C@H](c3ccc(NC(C)C)nc23)c2ccc3OCOc3c2)C(O)=O)c(OC(C)CO)c1
Show InChI InChI=1S/C29H32N2O7/c1-15(2)30-24-10-8-20-25(17-5-9-21-23(11-17)37-14-36-21)27(29(33)34)26(28(20)31-24)19-7-6-18(35-4)12-22(19)38-16(3)13-32/h5-12,15-16,25-27,32H,13-14H2,1-4H3,(H,30,31)(H,33,34)/t16?,25-,26-,27+/m0/s1
n/an/a 78n/an/an/an/an/an/a
Banyu Tsukuba Research Institute in collaboration with Merck Research Laboratories
Curated by ChEMBL
Assay Description
Inhibitory activity against [125I]-ET-1 binding to human endothelin B receptor
Bioorg Med Chem Lett 14: 1503-7 (2004)
Article DOI: 10.1016/j.bmcl.2004.01.008
BindingDB Entry DOI: 10.7270/Q23R0SB4
Endothelin-1 receptor
(Homo sapiens (Human))
BDBM50141467
((5S,6R,7R)-5-Benzo[1,3]dioxol-5-yl-7-[2-(2-hydroxy...)
Show SMILES COc1ccc([C@H]2[C@@H]([C@H](c3ccc(NC(C)C)nc23)c2ccc3OCOc3c2)C(O)=O)c(OC(C)CO)c1
Show InChI InChI=1S/C29H32N2O7/c1-15(2)30-24-10-8-20-25(17-5-9-21-23(11-17)37-14-36-21)27(29(33)34)26(28(20)31-24)19-7-6-18(35-4)12-22(19)38-16(3)13-32/h5-12,15-16,25-27,32H,13-14H2,1-4H3,(H,30,31)(H,33,34)/t16?,25-,26-,27+/m0/s1
n/an/a 0.0360n/an/an/an/an/an/a
Banyu Tsukuba Research Institute in collaboration with Merck Research Laboratories
Curated by ChEMBL
Assay Description
Inhibitory activity against [125I]-ET-1 binding to human endothelin A receptor
Bioorg Med Chem Lett 14: 1503-7 (2004)
Article DOI: 10.1016/j.bmcl.2004.01.008
BindingDB Entry DOI: 10.7270/Q23R0SB4
Endothelin receptor, ET-A/ET-B
(Homo sapiens (Human))
BDBM50141467
((5S,6R,7R)-5-Benzo[1,3]dioxol-5-yl-7-[2-(2-hydroxy...)
Show SMILES COc1ccc([C@H]2[C@@H]([C@H](c3ccc(NC(C)C)nc23)c2ccc3OCOc3c2)C(O)=O)c(OC(C)CO)c1
Show InChI InChI=1S/C29H32N2O7/c1-15(2)30-24-10-8-20-25(17-5-9-21-23(11-17)37-14-36-21)27(29(33)34)26(28(20)31-24)19-7-6-18(35-4)12-22(19)38-16(3)13-32/h5-12,15-16,25-27,32H,13-14H2,1-4H3,(H,30,31)(H,33,34)/t16?,25-,26-,27+/m0/s1
n/an/a 61n/an/an/an/an/an/a
Banyu Tsukuba Research Institute in collaboration with Merck Research Laboratories
Curated by ChEMBL
Assay Description
Inhibitory activity against [125I]-ET-1 binding to human endothelin B receptor
Bioorg Med Chem Lett 14: 1503-7 (2004)
Article DOI: 10.1016/j.bmcl.2004.01.008
BindingDB Entry DOI: 10.7270/Q23R0SB4
Endothelin-1 receptor
(Homo sapiens (Human))
BDBM50141467
((5S,6R,7R)-5-Benzo[1,3]dioxol-5-yl-7-[2-(2-hydroxy...)
Show SMILES COc1ccc([C@H]2[C@@H]([C@H](c3ccc(NC(C)C)nc23)c2ccc3OCOc3c2)C(O)=O)c(OC(C)CO)c1
Show InChI InChI=1S/C29H32N2O7/c1-15(2)30-24-10-8-20-25(17-5-9-21-23(11-17)37-14-36-21)27(29(33)34)26(28(20)31-24)19-7-6-18(35-4)12-22(19)38-16(3)13-32/h5-12,15-16,25-27,32H,13-14H2,1-4H3,(H,30,31)(H,33,34)/t16?,25-,26-,27+/m0/s1
n/an/a 0.0570n/an/an/an/an/an/a
Banyu Tsukuba Research Institute in collaboration with Merck Research Laboratories
Curated by ChEMBL
Assay Description
Inhibitory activity against [125I]-ET-1 binding to human endothelin A receptor
Bioorg Med Chem Lett 14: 1503-7 (2004)
Article DOI: 10.1016/j.bmcl.2004.01.008
BindingDB Entry DOI: 10.7270/Q23R0SB4