BDBM50144734 4-[2-Amino-6-(5-bromo-2-ethoxy-phenyl)-pyrimidin-4-ylamino]-N-hydroxy-benzamide::CHEMBL73574
SMILES: CCOc1ccc(Br)cc1-c1cc(Nc2ccc(cc2)C(=O)NO)nc(N)n1
InChI Key: InChIKey=IZSKXZKMVDSGJL-UHFFFAOYSA-N
Data: 1 IC50
Activity Spreadsheet -- Enzyme Inhibition Constant Data from BindingDB
Found 1 hit for monomerid = 50144734
Trg + Lig
Ki
nM
ΔG°
kcal/mole
IC50
nM
Kd
nM
EC50/IC50
nM
koff
s-1
kon
M-1s-1
pHTemp
°C
1-acylglycerol-3-phosphate O-acyltransferase beta
(Homo sapiens (Human))
BDBM50144734
(4-[2-Amino-6-(5-bromo-2-ethoxy-phenyl)-pyrimidin-4...)
Show SMILES CCOc1ccc(Br)cc1-c1cc(Nc2ccc(cc2)C(=O)NO)nc(N)n1
Show InChI InChI=1S/C19H18BrN5O3/c1-2-28-16-8-5-12(20)9-14(16)15-10-17(24-19(21)23-15)22-13-6-3-11(4-7-13)18(26)25-27/h3-10,27H,2H2,1H3,(H,25,26)(H3,21,22,23,24)
Reactome pathway
n/an/a 88n/an/an/an/an/an/a
Cell Therapeutics, Inc
Curated by ChEMBL
Assay Description
Inhibitory activity against Lysophosphatidic acid acyltransferase-beta expressed in Sf9 insect cell membranes
Bioorg Med Chem Lett 14: 2303-8 (2004)
Article DOI: 10.1016/j.bmcl.2004.01.104
BindingDB Entry DOI: 10.7270/Q2Q23ZPH