BDBM50145715 (R)-2-Methyl-3-{4-[2-(5-methyl-2-phenyl-oxazol-4-yl)-ethoxy]-phenyl}-2-phenoxy-propionic acid::CHEMBL412371
SMILES: Cc1oc(nc1CCOc1ccc(C[C@@](C)(Oc2ccccc2)C(O)=O)cc1)-c1ccccc1
InChI Key: InChIKey=JSTSZHVRXHMZQK-MUUNZHRXSA-N
Data: 7 IC50  5 EC50
Activity Spreadsheet -- Enzyme Inhibition Constant Data from BindingDB
Found 12 hits for monomerid = 50145715
Trg + Lig
Ki
nM
ΔG°
kcal/mole
IC50
nM
Kd
nM
EC50/IC50
nM
koff
s-1
kon
M-1s-1
pHTemp
°C
Peroxisome proliferator-activated receptor
(Homo sapiens (Human))
BDBM50145715
((R)-2-Methyl-3-{4-[2-(5-methyl-2-phenyl-oxazol-4-y...)
Show SMILES Cc1oc(nc1CCOc1ccc(C[C@@](C)(Oc2ccccc2)C(O)=O)cc1)-c1ccccc1
Show InChI InChI=1S/C28H27NO5/c1-20-25(29-26(33-20)22-9-5-3-6-10-22)17-18-32-23-15-13-21(14-16-23)19-28(2,27(30)31)34-24-11-7-4-8-12-24/h3-16H,17-19H2,1-2H3,(H,30,31)/t28-/m1/s1
NCI pathway
Reactome pathway
n/an/an/an/a 382n/an/an/an/a
Lilly Research Laboratories
Curated by ChEMBL
Assay Description
Transcriptional activation of reporter assay by PPAR gamma receptor in CV-1 cells
J Med Chem 47: 2422-5 (2004)
Article DOI: 10.1021/jm0342616
BindingDB Entry DOI: 10.7270/Q2TQ6100
Peroxisome proliferator-activated receptor alpha (PPAR alpha)
(Homo sapiens (Human))
BDBM50145715
((R)-2-Methyl-3-{4-[2-(5-methyl-2-phenyl-oxazol-4-y...)
Show SMILES Cc1oc(nc1CCOc1ccc(C[C@@](C)(Oc2ccccc2)C(O)=O)cc1)-c1ccccc1
Show InChI InChI=1S/C28H27NO5/c1-20-25(29-26(33-20)22-9-5-3-6-10-22)17-18-32-23-15-13-21(14-16-23)19-28(2,27(30)31)34-24-11-7-4-8-12-24/h3-16H,17-19H2,1-2H3,(H,30,31)/t28-/m1/s1
n/an/an/an/a 390n/an/an/an/a
Lilly Research Laboratories
Curated by ChEMBL
Assay Description
Transcriptional activation of reporter assay by human Peroxisome proliferator activated receptor alpha in CV-1 cells
J Med Chem 47: 2422-5 (2004)
Article DOI: 10.1021/jm0342616
BindingDB Entry DOI: 10.7270/Q2TQ6100
Peroxisome proliferator-activated receptor delta
(Homo sapiens (Human))
BDBM50145715
((R)-2-Methyl-3-{4-[2-(5-methyl-2-phenyl-oxazol-4-y...)
Show SMILES Cc1oc(nc1CCOc1ccc(C[C@@](C)(Oc2ccccc2)C(O)=O)cc1)-c1ccccc1
Show InChI InChI=1S/C28H27NO5/c1-20-25(29-26(33-20)22-9-5-3-6-10-22)17-18-32-23-15-13-21(14-16-23)19-28(2,27(30)31)34-24-11-7-4-8-12-24/h3-16H,17-19H2,1-2H3,(H,30,31)/t28-/m1/s1
n/an/an/an/a 3.01E+3n/an/an/an/a
Lilly Research Laboratories
Curated by ChEMBL
Assay Description
Transcriptonal activation of reporter assay by human Peroxisome proliferator activated receptor delta in CV-1 cells
J Med Chem 47: 2422-5 (2004)
Article DOI: 10.1021/jm0342616
BindingDB Entry DOI: 10.7270/Q2TQ6100
Peroxisome proliferator-activated receptor
(Homo sapiens (Human))
BDBM50145715
((R)-2-Methyl-3-{4-[2-(5-methyl-2-phenyl-oxazol-4-y...)
Show SMILES Cc1oc(nc1CCOc1ccc(C[C@@](C)(Oc2ccccc2)C(O)=O)cc1)-c1ccccc1
Show InChI InChI=1S/C28H27NO5/c1-20-25(29-26(33-20)22-9-5-3-6-10-22)17-18-32-23-15-13-21(14-16-23)19-28(2,27(30)31)34-24-11-7-4-8-12-24/h3-16H,17-19H2,1-2H3,(H,30,31)/t28-/m1/s1
NCI pathway
Reactome pathway
n/an/a 388n/an/an/an/an/an/a
Lilly Research Laboratories
Curated by ChEMBL
Assay Description
Displacement of PPARgamma agonist from human PPAR gamma receptor
J Med Chem 47: 2422-5 (2004)
Article DOI: 10.1021/jm0342616
BindingDB Entry DOI: 10.7270/Q2TQ6100
Peroxisome proliferator-activated receptor delta
(Homo sapiens (Human))
BDBM50145715
((R)-2-Methyl-3-{4-[2-(5-methyl-2-phenyl-oxazol-4-y...)
Show SMILES Cc1oc(nc1CCOc1ccc(C[C@@](C)(Oc2ccccc2)C(O)=O)cc1)-c1ccccc1
Show InChI InChI=1S/C28H27NO5/c1-20-25(29-26(33-20)22-9-5-3-6-10-22)17-18-32-23-15-13-21(14-16-23)19-28(2,27(30)31)34-24-11-7-4-8-12-24/h3-16H,17-19H2,1-2H3,(H,30,31)/t28-/m1/s1
n/an/a 2.69E+3n/an/an/an/an/an/a
Lilly Research Laboratories
Curated by ChEMBL
Assay Description
Displacement of PPARalpha/delta agonist from human Peroxisome proliferator activated receptor delta
J Med Chem 47: 2422-5 (2004)
Article DOI: 10.1021/jm0342616
BindingDB Entry DOI: 10.7270/Q2TQ6100
Peroxisome proliferator-activated receptor
(Homo sapiens (Human))
BDBM50145715
((R)-2-Methyl-3-{4-[2-(5-methyl-2-phenyl-oxazol-4-y...)
Show SMILES Cc1oc(nc1CCOc1ccc(C[C@@](C)(Oc2ccccc2)C(O)=O)cc1)-c1ccccc1
Show InChI InChI=1S/C28H27NO5/c1-20-25(29-26(33-20)22-9-5-3-6-10-22)17-18-32-23-15-13-21(14-16-23)19-28(2,27(30)31)34-24-11-7-4-8-12-24/h3-16H,17-19H2,1-2H3,(H,30,31)/t28-/m1/s1
NCI pathway
Reactome pathway
n/an/an/an/a 380n/an/an/an/a
TBA
Assay Description
Transactivation of Homo sapiens (human) PPARgamma assessed as luciferase activity by reporter gene assay
Citation and Details
Article DOI: 10.1007/s00044-011-9818-7
BindingDB Entry DOI: 10.7270/Q2R49TNP
Peroxisome proliferator-activated receptor alpha
(Mus musculus)
BDBM50145715
((R)-2-Methyl-3-{4-[2-(5-methyl-2-phenyl-oxazol-4-y...)
Show SMILES Cc1oc(nc1CCOc1ccc(C[C@@](C)(Oc2ccccc2)C(O)=O)cc1)-c1ccccc1
Show InChI InChI=1S/C28H27NO5/c1-20-25(29-26(33-20)22-9-5-3-6-10-22)17-18-32-23-15-13-21(14-16-23)19-28(2,27(30)31)34-24-11-7-4-8-12-24/h3-16H,17-19H2,1-2H3,(H,30,31)/t28-/m1/s1
Reactome pathway
n/an/a 6.76E+3n/an/an/an/an/an/a
Lilly Research Laboratories
Curated by ChEMBL
Assay Description
In vitro inhibition of mouse Peroxisome proliferator activated receptor alpha
Bioorg Med Chem Lett 14: 6113-6 (2004)
Article DOI: 10.1016/j.bmcl.2004.09.031
BindingDB Entry DOI: 10.7270/Q2QN67J1
Peroxisome proliferator-activated receptor delta
(Homo sapiens (Human))
BDBM50145715
((R)-2-Methyl-3-{4-[2-(5-methyl-2-phenyl-oxazol-4-y...)
Show SMILES Cc1oc(nc1CCOc1ccc(C[C@@](C)(Oc2ccccc2)C(O)=O)cc1)-c1ccccc1
Show InChI InChI=1S/C28H27NO5/c1-20-25(29-26(33-20)22-9-5-3-6-10-22)17-18-32-23-15-13-21(14-16-23)19-28(2,27(30)31)34-24-11-7-4-8-12-24/h3-16H,17-19H2,1-2H3,(H,30,31)/t28-/m1/s1
n/an/a 2.69E+3n/an/an/an/an/an/a
Universidad Nacional Aut£noma de M£xico
Curated by ChEMBL
Assay Description
Agonist activity at PPARdelta
Bioorg Med Chem 20: 3523-32 (2012)
Article DOI: 10.1016/j.bmc.2012.04.005
BindingDB Entry DOI: 10.7270/Q2MP54B4
Peroxisome proliferator-activated receptor
(Homo sapiens (Human))
BDBM50145715
((R)-2-Methyl-3-{4-[2-(5-methyl-2-phenyl-oxazol-4-y...)
Show SMILES Cc1oc(nc1CCOc1ccc(C[C@@](C)(Oc2ccccc2)C(O)=O)cc1)-c1ccccc1
Show InChI InChI=1S/C28H27NO5/c1-20-25(29-26(33-20)22-9-5-3-6-10-22)17-18-32-23-15-13-21(14-16-23)19-28(2,27(30)31)34-24-11-7-4-8-12-24/h3-16H,17-19H2,1-2H3,(H,30,31)/t28-/m1/s1
NCI pathway
Reactome pathway
n/an/a 388n/an/an/an/an/an/a
Universidad Nacional Aut£noma de M£xico
Curated by ChEMBL
Assay Description
Agonist activity at PPARgamma
Bioorg Med Chem 20: 3523-32 (2012)
Article DOI: 10.1016/j.bmc.2012.04.005
BindingDB Entry DOI: 10.7270/Q2MP54B4
Peroxisome proliferator-activated receptor alpha (PPAR alpha)
(Homo sapiens (Human))
BDBM50145715
((R)-2-Methyl-3-{4-[2-(5-methyl-2-phenyl-oxazol-4-y...)
Show SMILES Cc1oc(nc1CCOc1ccc(C[C@@](C)(Oc2ccccc2)C(O)=O)cc1)-c1ccccc1
Show InChI InChI=1S/C28H27NO5/c1-20-25(29-26(33-20)22-9-5-3-6-10-22)17-18-32-23-15-13-21(14-16-23)19-28(2,27(30)31)34-24-11-7-4-8-12-24/h3-16H,17-19H2,1-2H3,(H,30,31)/t28-/m1/s1
n/an/a 1.55E+3n/an/an/an/an/an/a
Universidad Nacional Aut£noma de M£xico
Curated by ChEMBL
Assay Description
Agonist activity at PPARalpha
Bioorg Med Chem 20: 3523-32 (2012)
Article DOI: 10.1016/j.bmc.2012.04.005
BindingDB Entry DOI: 10.7270/Q2MP54B4
Peroxisome proliferator-activated receptor
(Homo sapiens (Human))
BDBM50145715
((R)-2-Methyl-3-{4-[2-(5-methyl-2-phenyl-oxazol-4-y...)
Show SMILES Cc1oc(nc1CCOc1ccc(C[C@@](C)(Oc2ccccc2)C(O)=O)cc1)-c1ccccc1
Show InChI InChI=1S/C28H27NO5/c1-20-25(29-26(33-20)22-9-5-3-6-10-22)17-18-32-23-15-13-21(14-16-23)19-28(2,27(30)31)34-24-11-7-4-8-12-24/h3-16H,17-19H2,1-2H3,(H,30,31)/t28-/m1/s1
n/an/an/an/a 389n/an/an/an/a
TBA
Assay Description
Transactivation of Homo sapiens (human) PPARalpha assessed as luciferase activity by reporter gene assay
Citation and Details
Article DOI: 10.1007/s00044-011-9818-7
BindingDB Entry DOI: 10.7270/Q2R49TNP
Peroxisome proliferator-activated receptor alpha (PPAR alpha)
(Homo sapiens (Human))
BDBM50145715
((R)-2-Methyl-3-{4-[2-(5-methyl-2-phenyl-oxazol-4-y...)
Show SMILES Cc1oc(nc1CCOc1ccc(C[C@@](C)(Oc2ccccc2)C(O)=O)cc1)-c1ccccc1
Show InChI InChI=1S/C28H27NO5/c1-20-25(29-26(33-20)22-9-5-3-6-10-22)17-18-32-23-15-13-21(14-16-23)19-28(2,27(30)31)34-24-11-7-4-8-12-24/h3-16H,17-19H2,1-2H3,(H,30,31)/t28-/m1/s1
n/an/a 1.55E+3n/an/an/an/an/an/a
Lilly Research Laboratories
Curated by ChEMBL
Assay Description
Displacement of PPARalpha/delta agonist from human Peroxisome proliferator activated receptor alpha
J Med Chem 47: 2422-5 (2004)
Article DOI: 10.1021/jm0342616
BindingDB Entry DOI: 10.7270/Q2TQ6100