BDBM50145946 CHEMBL3763931
SMILES: CN1CCCN(Cc2ccc(c(F)c2)-c2ccc(CN3CCCN(C)CC3)cc2C#N)CC1
InChI Key: InChIKey=IIVUZDODNKDQAS-UHFFFAOYSA-N
Data: 2 IC50  1 Kd
Activity Spreadsheet -- Enzyme Inhibition Constant Data from BindingDB
Found 3 hits for monomerid = 50145946
Trg + Lig
Ki
nM
ΔG°
kcal/mole
IC50
nM
Kd
nM
EC50/IC50
nM
koff
s-1
kon
M-1s-1
pHTemp
°C
Choline kinase alpha
(Homo sapiens (Human))
BDBM50145946
(CHEMBL3763931)
Show SMILES CN1CCCN(Cc2ccc(c(F)c2)-c2ccc(CN3CCCN(C)CC3)cc2C#N)CC1
Show InChI InChI=1S/C27H36FN5/c1-30-9-3-11-32(15-13-30)20-22-5-7-25(24(17-22)19-29)26-8-6-23(18-27(26)28)21-33-12-4-10-31(2)14-16-33/h5-8,17-18H,3-4,9-16,20-21H2,1-2H3
Reactome pathway
n/an/a 85n/an/an/an/an/an/a
ARIAD Pharmaceuticals, Inc.
Curated by ChEMBL
Assay Description
Inhibition of human N-terminal truncated ChoKalpha1 (75 to 457 residues) using choline chloride as substrate measured over 10 to 30 mins by coupled A...
J Med Chem 59: 671-86 (2016)
BindingDB Entry DOI: 10.7270/Q23X88HX
Choline kinase alpha
(Homo sapiens (Human))
BDBM50145946
(CHEMBL3763931)
Show SMILES CN1CCCN(Cc2ccc(c(F)c2)-c2ccc(CN3CCCN(C)CC3)cc2C#N)CC1
Show InChI InChI=1S/C27H36FN5/c1-30-9-3-11-32(15-13-30)20-22-5-7-25(24(17-22)19-29)26-8-6-23(18-27(26)28)21-33-12-4-10-31(2)14-16-33/h5-8,17-18H,3-4,9-16,20-21H2,1-2H3
Reactome pathway
n/an/a 750n/an/an/an/an/an/a
ARIAD Pharmaceuticals, Inc.
Curated by ChEMBL
Assay Description
Inhibition of ChoKalpha in human MDA-MB-415 cells assessed as reduction in phosphocholine level after 24 hrs by NMR analysis
J Med Chem 59: 671-86 (2016)
BindingDB Entry DOI: 10.7270/Q23X88HX
Choline kinase alpha
(Homo sapiens (Human))
BDBM50145946
(CHEMBL3763931)
Show SMILES CN1CCCN(Cc2ccc(c(F)c2)-c2ccc(CN3CCCN(C)CC3)cc2C#N)CC1
Show InChI InChI=1S/C27H36FN5/c1-30-9-3-11-32(15-13-30)20-22-5-7-25(24(17-22)19-29)26-8-6-23(18-27(26)28)21-33-12-4-10-31(2)14-16-33/h5-8,17-18H,3-4,9-16,20-21H2,1-2H3
Reactome pathway
n/an/an/a 99n/an/an/an/an/a
ARIAD Pharmaceuticals, Inc.
Curated by ChEMBL
Assay Description
Binding affinity to human N-terminal truncated ChoKalpha1 (75 to 457 residues) by surface plasmon resonance assay
J Med Chem 59: 671-86 (2016)
BindingDB Entry DOI: 10.7270/Q23X88HX