BDBM50146075 CHEMBL3765502
SMILES: CN(C)c1ccc(cc1)C(=O)N\N=C\c1cccc(c1)C(=O)NO
InChI Key: InChIKey=GGOMUUCAQVUHPY-WOJGMQOQSA-N
Data: 5 IC50
Activity Spreadsheet -- Enzyme Inhibition Constant Data from BindingDB
Found 5 hits for monomerid = 50146075
Trg + Lig
Ki
nM
ΔG°
kcal/mole
IC50
nM
Kd
nM
EC50/IC50
nM
koff
s-1
kon
M-1s-1
pHTemp
°C
Histone deacetylase
(Rattus norvegicus)
BDBM50146075
(CHEMBL3765502)
Show SMILES CN(C)c1ccc(cc1)C(=O)N\N=C\c1cccc(c1)C(=O)NO
Show InChI InChI=1S/C17H18N4O3/c1-21(2)15-8-6-13(7-9-15)16(22)19-18-11-12-4-3-5-14(10-12)17(23)20-24/h3-11,24H,1-2H3,(H,19,22)(H,20,23)/b18-11+
n/an/a 1.20E+3n/an/an/an/an/an/a
Universidade Federal de Alfenas
Curated by ChEMBL
Assay Description
Inhibition of HDAC in rat liver by fluorimetry
J Med Chem 59: 655-70 (2016)
BindingDB Entry DOI: 10.7270/Q2VD71B2
Histone deacetylase 1
(Homo sapiens (Human))
BDBM50146075
(CHEMBL3765502)
Show SMILES CN(C)c1ccc(cc1)C(=O)N\N=C\c1cccc(c1)C(=O)NO
Show InChI InChI=1S/C17H18N4O3/c1-21(2)15-8-6-13(7-9-15)16(22)19-18-11-12-4-3-5-14(10-12)17(23)20-24/h3-11,24H,1-2H3,(H,19,22)(H,20,23)/b18-11+
NCI pathway
Reactome pathway
n/an/a>1.00E+4n/an/an/an/an/an/a
Universidade Federal de Alfenas
Curated by ChEMBL
Assay Description
Inhibition of recombinant human HDAC1 by fluorimetry
J Med Chem 59: 655-70 (2016)
BindingDB Entry DOI: 10.7270/Q2VD71B2
Histone deacetylase 8
(Homo sapiens (Human))
BDBM50146075
(CHEMBL3765502)
Show SMILES CN(C)c1ccc(cc1)C(=O)N\N=C\c1cccc(c1)C(=O)NO
Show InChI InChI=1S/C17H18N4O3/c1-21(2)15-8-6-13(7-9-15)16(22)19-18-11-12-4-3-5-14(10-12)17(23)20-24/h3-11,24H,1-2H3,(H,19,22)(H,20,23)/b18-11+
NCI pathway
Reactome pathway
n/an/a 2.20E+3n/an/an/an/an/an/a
Universidade Federal de Alfenas
Curated by ChEMBL
Assay Description
Inhibition of recombinant human HDAC8 by fluorimetry
J Med Chem 59: 655-70 (2016)
BindingDB Entry DOI: 10.7270/Q2VD71B2
Histone deacetylase 6
(Homo sapiens (Human))
BDBM50146075
(CHEMBL3765502)
Show SMILES CN(C)c1ccc(cc1)C(=O)N\N=C\c1cccc(c1)C(=O)NO
Show InChI InChI=1S/C17H18N4O3/c1-21(2)15-8-6-13(7-9-15)16(22)19-18-11-12-4-3-5-14(10-12)17(23)20-24/h3-11,24H,1-2H3,(H,19,22)(H,20,23)/b18-11+
NCI pathway
Reactome pathway
n/an/a 390n/an/an/an/an/an/a
Universidade Federal de Alfenas
Curated by ChEMBL
Assay Description
Inhibition of recombinant human HDAC6 by fluorimetry
J Med Chem 59: 655-70 (2016)
BindingDB Entry DOI: 10.7270/Q2VD71B2
Histone deacetylase 2
(Homo sapiens (Human))
BDBM50146075
(CHEMBL3765502)
Show SMILES CN(C)c1ccc(cc1)C(=O)N\N=C\c1cccc(c1)C(=O)NO
Show InChI InChI=1S/C17H18N4O3/c1-21(2)15-8-6-13(7-9-15)16(22)19-18-11-12-4-3-5-14(10-12)17(23)20-24/h3-11,24H,1-2H3,(H,19,22)(H,20,23)/b18-11+
NCI pathway
Reactome pathway
n/an/a>1.00E+4n/an/an/an/an/an/a
Universidade Federal de Alfenas
Curated by ChEMBL
Assay Description
Inhibition of recombinant human HDAC2 by fluorimetry
J Med Chem 59: 655-70 (2016)
BindingDB Entry DOI: 10.7270/Q2VD71B2