BDBM50146529 CHEMBL3764023
SMILES: Cl.NOCc1ccc(Cl)cc1
InChI Key: InChIKey=VIFDVZZLHVXUHV-UHFFFAOYSA-N
Data: 1 IC50
Activity Spreadsheet -- Enzyme Inhibition Constant Data from BindingDB
Found 1 hit for monomerid = 50146529
Trg + Lig
Ki
nM
ΔG°
kcal/mole
IC50
nM
Kd
nM
EC50/IC50
nM
koff
s-1
kon
M-1s-1
pHTemp
°C
Indoleamine 2,3-dioxygenase
(Homo sapiens (Human))
BDBM50146529
(CHEMBL3764023)
Show SMILES Cl.NOCc1ccc(Cl)cc1
Show InChI InChI=1S/C7H8ClNO.ClH/c8-7-3-1-6(2-4-7)5-10-9;/h1-4H,5,9H2;1H
Reactome pathway
n/an/a 1.30E+3n/an/an/an/an/an/a
Bryn Mawr College
Curated by ChEMBL
Assay Description
Inhibition of recombinant human IDO1 assessed as reduction in kynurenine production using L-tryptophan as substrate after 60 mins by microplate reade...
Eur J Med Chem 108: 564-76 (2016)
BindingDB Entry DOI: 10.7270/Q26Q203T