BDBM50147621 CHEMBL3769979
SMILES: COc1ccc(cc1OC)-c1cn(C)c(=O)c2cc(sc12)C(=O)N1CCN(CC1)S(C)(=O)=O
InChI Key: InChIKey=BEIFGZXXCPXAAY-UHFFFAOYSA-N
Data: 2 IC50
PDB links: 2 PDB IDs match this monomer.
Activity Spreadsheet -- Enzyme Inhibition Constant Data from BindingDB
Found 1 hit for monomerid = 50147621
Trg + Lig
Ki
nM
ΔG°
kcal/mole
IC50
nM
Kd
nM
EC50/IC50
nM
koff
s-1
kon
M-1s-1
pHTemp
°C
Metabotropic glutamate receptor 4
(Homo sapiens (Human))
CHEMBL4788007
Show SMILES COc1ccc(cc1OC)-c1cn(C)c(=O)c2cc(sc12)C(=O)N1CCN(CC1)S(C)(=O)=O
Show InChI InChI=1S/C22H25N3O6S2/c1-23-13-16(14-5-6-17(30-2)18(11-14)31-3)20-15(21(23)26)12-19(32-20)22(27)24-7-9-25(10-8-24)33(4,28)29/h5-6,11-13H,7-10H2,1-4H3
n/an/an/an/a 732n/an/an/an/a
TBA
Assay Description
Inhibition of human plasmin using pyroGlu-Phe-Lys-pNA.HCl
Citation and Details