BDBM50148457 CHEMBL3769509
SMILES: Cn1cc(-c2ccccc2)c2sc(cc2c1=O)C(=N)NC1CCS(=O)(=O)CC1
InChI Key: InChIKey=TTYKSANGMNELCB-UHFFFAOYSA-N
Data: 2 IC50
Activity Spreadsheet -- Enzyme Inhibition Constant Data from BindingDB
Found 1 hit for monomerid = 50148457
Trg + Lig
Ki
nM
ΔG°
kcal/mole
IC50
nM
Kd
nM
EC50/IC50
nM
koff
s-1
kon
M-1s-1
pHTemp
°C
Dual specificity protein kinase CLK1
(Mus musculus)
BDBM50148457
(CHEMBL4780720)
Show SMILES Cn1cc(-c2ccccc2)c2sc(cc2c1=O)C(=N)NC1CCS(=O)(=O)CC1
Show InChI InChI=1S/C20H21N3O3S2/c1-23-12-16(13-5-3-2-4-6-13)18-15(20(23)24)11-17(27-18)19(21)22-14-7-9-28(25,26)10-8-14/h2-6,11-12,14H,7-10H2,1H3,(H2,21,22)
n/an/a 125n/an/an/an/an/an/a
TBA
Assay Description
Inhibition of human urine urokinase using L-PyroGlu-Gly-Arg-pNA.HCl substrate at 5 uM
Citation and Details