BDBM50148521 (S)-2-[2-Hydroxy-2-((R)-4-hydroxy-3-methanesulfonylamino-phenyl)-ethylamino]-N-(4-hydroxy-phenyl)-2-(4-methoxy-phenyl)-propionamide::CHEMBL116294
SMILES: COc1ccc(cc1)[C@](C)(NC[C@H](O)c1ccc(O)c(NS(C)(=O)=O)c1)C(=O)Nc1ccc(O)cc1
InChI Key: InChIKey=LYIHONGEYSWGDC-ZCYQVOJMSA-N
Data: 1 KI  1 EC50
Activity Spreadsheet -- Enzyme Inhibition Constant Data from BindingDB
Found 2 hits for monomerid = 50148521
Trg + Lig
Ki
nM
ΔG°
kcal/mole
IC50
nM
Kd
nM
EC50/IC50
nM
koff
s-1
kon
M-1s-1
pHTemp
°C
Beta-3 adrenergic receptor
(Homo sapiens (Human))
BDBM50148521
((S)-2-[2-Hydroxy-2-((R)-4-hydroxy-3-methanesulfony...)
Show SMILES COc1ccc(cc1)[C@](C)(NC[C@H](O)c1ccc(O)c(NS(C)(=O)=O)c1)C(=O)Nc1ccc(O)cc1
Show InChI InChI=1S/C25H29N3O7S/c1-25(17-5-11-20(35-2)12-6-17,24(32)27-18-7-9-19(29)10-8-18)26-15-23(31)16-4-13-22(30)21(14-16)28-36(3,33)34/h4-14,23,26,28-31H,15H2,1-3H3,(H,27,32)/t23-,25-/m0/s1
Reactome pathway
23n/an/an/an/an/an/an/an/a
Bristol-Myers Squibb Pharmaceutical Research Institute
Curated by ChEMBL
Assay Description
Binding affinity towards human beta-3 adrenergic receptor expressed in CHO cells
Bioorg Med Chem Lett 14: 3525-9 (2004)
Article DOI: 10.1016/j.bmcl.2004.04.074
BindingDB Entry DOI: 10.7270/Q2MP52Q7
Beta-1 adrenergic receptor
(Homo sapiens (Human))
BDBM50148521
((S)-2-[2-Hydroxy-2-((R)-4-hydroxy-3-methanesulfony...)
Show SMILES COc1ccc(cc1)[C@](C)(NC[C@H](O)c1ccc(O)c(NS(C)(=O)=O)c1)C(=O)Nc1ccc(O)cc1
Show InChI InChI=1S/C25H29N3O7S/c1-25(17-5-11-20(35-2)12-6-17,24(32)27-18-7-9-19(29)10-8-18)26-15-23(31)16-4-13-22(30)21(14-16)28-36(3,33)34/h4-14,23,26,28-31H,15H2,1-3H3,(H,27,32)/t23-,25-/m0/s1
Reactome pathway
n/an/an/an/a 300n/an/an/an/a
Bristol-Myers Squibb Pharmaceutical Research Institute
Curated by ChEMBL
Assay Description
Effective concentration required for inhibitory activity towards human beta-1 adrenergic receptor
Bioorg Med Chem Lett 14: 3525-9 (2004)
Article DOI: 10.1016/j.bmcl.2004.04.074
BindingDB Entry DOI: 10.7270/Q2MP52Q7