BDBM50150103 CHEMBL338520::[2-(6-Chloro-1H-benzoimidazol-4-yloxy)-ethyl]-[3-(5-fluoro-1H-indol-3-yl)-propyl]-amine
SMILES: Fc1ccc2[nH]cc(CCCNCCOc3cc(Cl)cc4[nH]cnc34)c2c1
InChI Key: InChIKey=WHXNJTORMHZUJH-UHFFFAOYSA-N
Data: 2 KI  3 IC50
Activity Spreadsheet -- Enzyme Inhibition Constant Data from BindingDB
Found 5 hits for monomerid = 50150103
Trg + Lig
Ki
nM
ΔG°
kcal/mole
IC50
nM
Kd
nM
EC50/IC50
nM
koff
s-1
kon
M-1s-1
pHTemp
°C
Sodium-dependent serotonin transporter
(Rattus norvegicus (rat))
BDBM50150103
(CHEMBL338520 | [2-(6-Chloro-1H-benzoimidazol-4-ylo...)
Show SMILES Fc1ccc2[nH]cc(CCCNCCOc3cc(Cl)cc4[nH]cnc34)c2c1
Show InChI InChI=1S/C20H20ClFN4O/c21-14-8-18-20(26-12-25-18)19(9-14)27-7-6-23-5-1-2-13-11-24-17-4-3-15(22)10-16(13)17/h3-4,8-12,23-24H,1-2,5-7H2,(H,25,26)
0.390n/an/an/an/an/an/an/an/a
Wyeth Research
Curated by ChEMBL
Assay Description
Binding affinity against serotonin transporter in rat cortical tissues using radioligand [3H]-paroxetine
J Med Chem 47: 3823-42 (2004)
Article DOI: 10.1021/jm0304010
BindingDB Entry DOI: 10.7270/Q2S46RDW
5-hydroxytryptamine receptor 1A
(Homo sapiens (Human))
BDBM50150103
(CHEMBL338520 | [2-(6-Chloro-1H-benzoimidazol-4-ylo...)
Show SMILES Fc1ccc2[nH]cc(CCCNCCOc3cc(Cl)cc4[nH]cnc34)c2c1
Show InChI InChI=1S/C20H20ClFN4O/c21-14-8-18-20(26-12-25-18)19(9-14)27-7-6-23-5-1-2-13-11-24-17-4-3-15(22)10-16(13)17/h3-4,8-12,23-24H,1-2,5-7H2,(H,25,26)
10.7n/an/an/an/an/an/an/an/a
Wyeth Research
Curated by ChEMBL
Assay Description
Binding affinity against human 5-hydroxytryptamine 1A receptor in CHO cells labeled with [3H]-8-OH-DPAT radioligand
J Med Chem 47: 3823-42 (2004)
Article DOI: 10.1021/jm0304010
BindingDB Entry DOI: 10.7270/Q2S46RDW
5-hydroxytryptamine receptor 1A
(Homo sapiens (Human))
BDBM50150103
(CHEMBL338520 | [2-(6-Chloro-1H-benzoimidazol-4-ylo...)
Show SMILES Fc1ccc2[nH]cc(CCCNCCOc3cc(Cl)cc4[nH]cnc34)c2c1
Show InChI InChI=1S/C20H20ClFN4O/c21-14-8-18-20(26-12-25-18)19(9-14)27-7-6-23-5-1-2-13-11-24-17-4-3-15(22)10-16(13)17/h3-4,8-12,23-24H,1-2,5-7H2,(H,25,26)
n/an/a 238n/an/an/an/an/an/a
Wyeth Research
Curated by ChEMBL
Assay Description
Inhibition concentration against 5-hydroxytryptamine 1A receptor using cAMP as radioligand in CHO cells
J Med Chem 47: 3823-42 (2004)
Article DOI: 10.1021/jm0304010
BindingDB Entry DOI: 10.7270/Q2S46RDW
Sodium-dependent serotonin transporter
(Homo sapiens (Human))
BDBM50150103
(CHEMBL338520 | [2-(6-Chloro-1H-benzoimidazol-4-ylo...)
Show SMILES Fc1ccc2[nH]cc(CCCNCCOc3cc(Cl)cc4[nH]cnc34)c2c1
Show InChI InChI=1S/C20H20ClFN4O/c21-14-8-18-20(26-12-25-18)19(9-14)27-7-6-23-5-1-2-13-11-24-17-4-3-15(22)10-16(13)17/h3-4,8-12,23-24H,1-2,5-7H2,(H,25,26)
n/an/a 4.5n/an/an/an/an/an/a
Wyeth Research
Curated by ChEMBL
Assay Description
Inhibition concentration against [3H]-5-HT uptake by human serotonin transporter in JAR cells
J Med Chem 47: 3823-42 (2004)
Article DOI: 10.1021/jm0304010
BindingDB Entry DOI: 10.7270/Q2S46RDW
5-hydroxytryptamine receptor 1A
(Homo sapiens (Human))
BDBM50150103
(CHEMBL338520 | [2-(6-Chloro-1H-benzoimidazol-4-ylo...)
Show SMILES Fc1ccc2[nH]cc(CCCNCCOc3cc(Cl)cc4[nH]cnc34)c2c1
Show InChI InChI=1S/C20H20ClFN4O/c21-14-8-18-20(26-12-25-18)19(9-14)27-7-6-23-5-1-2-13-11-24-17-4-3-15(22)10-16(13)17/h3-4,8-12,23-24H,1-2,5-7H2,(H,25,26)
n/an/a 66.5n/an/an/an/an/an/a
Wyeth Research
Curated by ChEMBL
Assay Description
Inhibition concentration against binding of radioligand [35]GTPgammaS in CHO cells expressing 5-hydroxytryptamine 1A receptor
J Med Chem 47: 3823-42 (2004)
Article DOI: 10.1021/jm0304010
BindingDB Entry DOI: 10.7270/Q2S46RDW