BDBM50151035 4-{1-[3-(4-Oxo-3,4-dihydro-quinazolin-2-yl)-propyl]-1,2,3,6-tetrahydro-pyridin-4-yl}-benzonitrile::CHEMBL185742
SMILES: O=c1[nH]c(CCCN2CCC(=CC2)c2ccc(cc2)C#N)nc2ccccc12
InChI Key: InChIKey=MZHYWIJAWKIEEW-UHFFFAOYSA-N
Data: 1 IC50
Activity Spreadsheet -- Enzyme Inhibition Constant Data from BindingDB
Found 1 hit for monomerid = 50151035
Trg + Lig
Ki
nM
ΔG°
kcal/mole
IC50
nM
Kd
nM
EC50/IC50
nM
koff
s-1
kon
M-1s-1
pHTemp
°C
Poly [ADP-ribose] polymerase 1
(Homo sapiens (Human))
BDBM50151035
(4-{1-[3-(4-Oxo-3,4-dihydro-quinazolin-2-yl)-propyl...)
Show SMILES O=c1[nH]c(CCCN2CCC(=CC2)c2ccc(cc2)C#N)nc2ccccc12 |c:10|
Show InChI InChI=1S/C23H22N4O/c24-16-17-7-9-18(10-8-17)19-11-14-27(15-12-19)13-3-6-22-25-21-5-2-1-4-20(21)23(28)26-22/h1-2,4-5,7-11H,3,6,12-15H2,(H,25,26,28)
n/an/a 6n/an/an/an/an/an/a
Fujisawa Pharmaceutical Co., Ltd.
Curated by ChEMBL
Assay Description
In vitro inhibitory concentration against human recombinant Poly (ADP-ribose) polymerase 1
J Med Chem 47: 4151-4 (2004)
Article DOI: 10.1021/jm0499256
BindingDB Entry DOI: 10.7270/Q21G0KQ6