BDBM50153895 CHEMBL3774953
SMILES: COc1cc2ncnc(Nc3c(F)ccc(O)c3Cl)c2cc1OC
InChI Key: InChIKey=NRBCZVLKKQZZNF-UHFFFAOYSA-N
Data: 4 IC50
Activity Spreadsheet -- Enzyme Inhibition Constant Data from BindingDB
Found 4 hits for monomerid = 50153895
Trg + Lig
Ki
nM
ΔG°
kcal/mole
IC50
nM
Kd
nM
EC50/IC50
nM
koff
s-1
kon
M-1s-1
pHTemp
°C
Proto-oncogene tyrosine-protein kinase receptor Ret
(Homo sapiens (Human))
BDBM50153895
(CHEMBL3774953)
Show SMILES COc1cc2ncnc(Nc3c(F)ccc(O)c3Cl)c2cc1OC
Show InChI InChI=1S/C16H13ClFN3O3/c1-23-12-5-8-10(6-13(12)24-2)19-7-20-16(8)21-15-9(18)3-4-11(22)14(15)17/h3-7,22H,1-2H3,(H,19,20,21)
n/an/a 3.90n/an/an/an/an/an/a
University of Manchester
Curated by ChEMBL
Assay Description
Inhibition of human RET cytoplasmic domain (658 to 1114 residues) expressed in baculovirus system preincubated for 15 mins followed by substrate addi...
Eur J Med Chem 112: 20-32 (2016)
BindingDB Entry DOI: 10.7270/Q27W6F1V
Vascular endothelial growth factor receptor 2
(Homo sapiens (Human))
BDBM50153895
(CHEMBL3774953)
Show SMILES COc1cc2ncnc(Nc3c(F)ccc(O)c3Cl)c2cc1OC
Show InChI InChI=1S/C16H13ClFN3O3/c1-23-12-5-8-10(6-13(12)24-2)19-7-20-16(8)21-15-9(18)3-4-11(22)14(15)17/h3-7,22H,1-2H3,(H,19,20,21)
NCI pathway
Reactome pathway
n/an/a 5.40E+3n/an/an/an/an/an/a
University of Manchester
Curated by ChEMBL
Assay Description
Inhibition of KDR (unknown origin) expressed in mouse BA/F3 cells assessed as reduction in cell viability after 48 hrs by Cell titre glo-based lumine...
Eur J Med Chem 112: 20-32 (2016)
BindingDB Entry DOI: 10.7270/Q27W6F1V
Kinesin-1 heavy chain/ Tyrosine-protein kinase receptor RET
(Homo sapiens (Human))
BDBM50153895
(CHEMBL3774953)
Show SMILES COc1cc2ncnc(Nc3c(F)ccc(O)c3Cl)c2cc1OC
Show InChI InChI=1S/C16H13ClFN3O3/c1-23-12-5-8-10(6-13(12)24-2)19-7-20-16(8)21-15-9(18)3-4-11(22)14(15)17/h3-7,22H,1-2H3,(H,19,20,21)
n/an/a 260n/an/an/an/an/an/a
University of Manchester
Curated by ChEMBL
Assay Description
Inhibition of KIF5B/RET (unknown origin) expressed in mouse BA/F3 cells assessed as reduction in cell viability after 48 hrs by Cell titre glo-based ...
Eur J Med Chem 112: 20-32 (2016)
BindingDB Entry DOI: 10.7270/Q27W6F1V
Vascular endothelial growth factor receptor 2
(Homo sapiens (Human))
BDBM50153895
(CHEMBL3774953)
Show SMILES COc1cc2ncnc(Nc3c(F)ccc(O)c3Cl)c2cc1OC
Show InChI InChI=1S/C16H13ClFN3O3/c1-23-12-5-8-10(6-13(12)24-2)19-7-20-16(8)21-15-9(18)3-4-11(22)14(15)17/h3-7,22H,1-2H3,(H,19,20,21)
NCI pathway
Reactome pathway
n/an/a 1.10E+3n/an/an/an/an/an/a
University of Manchester
Curated by ChEMBL
Assay Description
Inhibition of recombinant His-tagged human KDR expressed in insect Sf21 cells preincubated for 15 mins followed by substrate addition measured after ...
Eur J Med Chem 112: 20-32 (2016)
BindingDB Entry DOI: 10.7270/Q27W6F1V