null
SMILES: CC1(Cc2ccccc2)C(=O)N(c2ccccc12)c1cc(Cl)cc(Cl)c1
InChI Key: InChIKey=MTCSXDMZKVZCAO-UHFFFAOYSA-N
Activity Spreadsheet -- Enzyme Inhibition Constant Data from BindingDB
Found 1 hit for monomerid = 50154484
Trg + Lig
Ki
nM
ΔG°
kcal/mole
IC50
nM
Kd
nM
EC50/IC50
nM
koff
s-1
kon
M-1s-1
pHTemp
°C
Integrin alpha-L/beta-2
(Homo sapiens (Human))
BDBM50154484
(3-Benzyl-1-(3,5-dichloro-phenyl)-3-methyl-1,3-dihy...)
Show SMILES CC1(Cc2ccccc2)C(=O)N(c2ccccc12)c1cc(Cl)cc(Cl)c1
Show InChI InChI=1S/C22H17Cl2NO/c1-22(14-15-7-3-2-4-8-15)19-9-5-6-10-20(19)25(21(22)26)18-12-16(23)11-17(24)13-18/h2-13H,14H2,1H3
n/an/an/a 760n/an/an/an/an/a
Boehringer Ingelheim Pharmaceuticals
Curated by ChEMBL
Assay Description
Dissociation constant for human Lymphocyte function associated antigen 1 in LFA-1/ICAM-1 binding assay
J Med Chem 47: 5356-66 (2004)
Article DOI: 10.1021/jm049657b
BindingDB Entry DOI: 10.7270/Q2B857MB